
./octez-client --protocol ProtoALphaALphaALphaALphaALphaALphaALphaALphaDdp3zK --mode mockup --no-base-dir-warnings run script michelson_test_scripts/opcodes/empty_map.tz on storage '{}' and input Unit --level 1 --trace-stack
storage
  { Elt "hello" "world" }
emitted operations
  
big_map diff
  
trace
  - location: 9 (just consumed gas: 8.180)
    [ (Pair Unit {}) ]
  - location: 9 (just consumed gas: 0.010)
    [  ]
  - location: 10 (just consumed gas: 0.300)
    [ {} ]
  - location: 13 (just consumed gas: 0.010)
    [ "world"
      {} ]
  - location: 16 (just consumed gas: 0.010)
    [ (Some "world")
      {} ]
  - location: 17 (just consumed gas: 0.010)
    [ "hello"
      (Some "world")
      {} ]
  - location: 20 (just consumed gas: 0.090)
    [ { Elt "hello" "world" } ]
  - location: 21 (just consumed gas: 0.010)
    [ {}
      { Elt "hello" "world" } ]
  - location: 23 (just consumed gas: 0.010)
    [ (Pair {} { Elt "hello" "world" }) ]

