
./octez-client --protocol ProtoALphaALphaALphaALphaALphaALphaALphaALphaDdp3zK --mode mockup --no-base-dir-warnings run script michelson_test_scripts/opcodes/list_map_block.tz on storage '{0}' and input '{}' --level 1 --trace-stack
storage
  {}
emitted operations
  
big_map diff
  
trace
  - location: 9 (just consumed gas: 11.783)
    [ (Pair {} { 0 }) ]
  - location: 9 (just consumed gas: 0.010)
    [ {} ]
  - location: 10 (just consumed gas: 0.010)
    [ 0
      {} ]
  - location: 13 (just consumed gas: 0.010)
    [ {}
      0 ]
  - location: 14 (just consumed gas: 0.060)
    [ {}
      0 ]
  - location: 26 (just consumed gas: 0.010)
    [ {}
      {}
      0 ]
  - location: 28 (just consumed gas: 0.010)
    [ (Pair {} {})
      0 ]
  - location: 29 (just consumed gas: 0.010)
    [ 0 ]
  - location: 31 (just consumed gas: 0.010)
    [  ]
  - location: 29 (just consumed gas: 0.035)
    [ (Pair {} {}) ]

