{
  "map": {
    "bloomer/bloomer_add_const": 461.4500000000014,
    "bloomer/bloomer_mem_const": 423.9300000000017,
    "builtin/Timer_latency": 15.82333333333333,
    "cache/CACHE_UPDATE/coeff": 43,
    "cache/CACHE_UPDATE/intercept": 600,
    "carbonated_map/compare_int": 2.183333333333339,
    "carbonated_map/find/intercept": 50,
    "carbonated_map/find/traversal_overhead": 2,
    "carbonated_map/fold_const": 50,
    "carbonated_map/fold_cost_per_item": 24,
    "dal/publish_slot_header_const": 16300000,
    "encoding/B58CHECK_DECODING_CHAIN_ID_const": 1600,
    "encoding/B58CHECK_DECODING_PUBLIC_KEY_HASH_bls_const": 3600,
    "encoding/B58CHECK_DECODING_PUBLIC_KEY_HASH_ed25519_const": 3300,
    "encoding/B58CHECK_DECODING_PUBLIC_KEY_HASH_p256_const": 3300,
    "encoding/B58CHECK_DECODING_PUBLIC_KEY_HASH_secp256k1_const": 3300,
    "encoding/B58CHECK_DECODING_PUBLIC_KEY_bls_const": 79000,
    "encoding/B58CHECK_DECODING_PUBLIC_KEY_ed25519_const": 4200,
    "encoding/B58CHECK_DECODING_PUBLIC_KEY_p256_const": 13450,
    "encoding/B58CHECK_DECODING_PUBLIC_KEY_secp256k1_const": 9000,
    "encoding/B58CHECK_DECODING_SECRET_KEY_bls_const": 4397.749999999982,
    "encoding/B58CHECK_DECODING_SECRET_KEY_ed25519_const": 3953.750000000009,
    "encoding/B58CHECK_DECODING_SECRET_KEY_p256_const": 3756.466666666679,
    "encoding/B58CHECK_DECODING_SECRET_KEY_secp256k1_const": 3924.773333333343,
    "encoding/B58CHECK_DECODING_SIGNATURE_bls_const": 6400,
    "encoding/B58CHECK_DECODING_SIGNATURE_ed25519_const": 6400,
    "encoding/B58CHECK_DECODING_SIGNATURE_p256_const": 6400,
    "encoding/B58CHECK_DECODING_SIGNATURE_secp256k1_const": 6400,
    "encoding/B58CHECK_ENCODING_CHAIN_ID_const": 1800,
    "encoding/B58CHECK_ENCODING_PUBLIC_KEY_HASH_bls_const": 3200,
    "encoding/B58CHECK_ENCODING_PUBLIC_KEY_HASH_ed25519_const": 3200,
    "encoding/B58CHECK_ENCODING_PUBLIC_KEY_HASH_p256_const": 3200,
    "encoding/B58CHECK_ENCODING_PUBLIC_KEY_HASH_secp256k1_const": 3200,
    "encoding/B58CHECK_ENCODING_PUBLIC_KEY_bls_const": 5900,
    "encoding/B58CHECK_ENCODING_PUBLIC_KEY_ed25519_const": 4500,
    "encoding/B58CHECK_ENCODING_PUBLIC_KEY_p256_const": 4550,
    "encoding/B58CHECK_ENCODING_PUBLIC_KEY_secp256k1_const": 4950,
    "encoding/B58CHECK_ENCODING_SECRET_KEY_bls_const": 3996.54000000001,
    "encoding/B58CHECK_ENCODING_SECRET_KEY_ed25519_const": 4029.473333333342,
    "encoding/B58CHECK_ENCODING_SECRET_KEY_p256_const": 4035.320000000008,
    "encoding/B58CHECK_ENCODING_SECRET_KEY_secp256k1_const": 4440.856666666648,
    "encoding/B58CHECK_ENCODING_SIGNATURE_bls_const": 8300,
    "encoding/B58CHECK_ENCODING_SIGNATURE_ed25519_const": 8300,
    "encoding/B58CHECK_ENCODING_SIGNATURE_p256_const": 8300,
    "encoding/B58CHECK_ENCODING_SIGNATURE_secp256k1_const": 8300,
    "encoding/BLS_FR_FROM_Z_const": 178.443333333333,
    "encoding/BLS_FR_TO_Z_const": 82.89333333333309,
    "encoding/CHECK_PRINTABLE_coeff": 10,
    "encoding/CHECK_PRINTABLE_const": 14,
    "encoding/DECODING_BLS_FR_const": 120,
    "encoding/DECODING_BLS_G1_const": 54600,
    "encoding/DECODING_BLS_G2_const": 69000,
    "encoding/DECODING_CHAIN_ID_const": 50,
    "encoding/DECODING_Chest_coeff": 0.03125,
    "encoding/DECODING_Chest_const": 3750,
    "encoding/DECODING_Chest_key_const": 9550,
    "encoding/DECODING_INT_coeff": 13.31369369965978,
    "encoding/DECODING_INT_const": 15.80000000000003,
    "encoding/DECODING_MICHELINE_micheline_bytes": 20,
    "encoding/DECODING_MICHELINE_micheline_int_bytes": 10,
    "encoding/DECODING_MICHELINE_micheline_string_bytes": 10,
    "encoding/DECODING_MICHELINE_micheline_traversal": 60,
    "encoding/DECODING_NAT_coeff": 13.27753944359873,
    "encoding/DECODING_NAT_const": 15.77000000000003,
    "encoding/DECODING_PUBLIC_KEY_HASH_bls_const": 60,
    "encoding/DECODING_PUBLIC_KEY_HASH_ed25519_const": 60,
    "encoding/DECODING_PUBLIC_KEY_HASH_p256_const": 60,
    "encoding/DECODING_PUBLIC_KEY_HASH_secp256k1_const": 60,
    "encoding/DECODING_PUBLIC_KEY_bls_const": 74000,
    "encoding/DECODING_PUBLIC_KEY_ed25519_const": 60,
    "encoding/DECODING_PUBLIC_KEY_p256_const": 9550,
    "encoding/DECODING_PUBLIC_KEY_secp256k1_const": 4900,
    "encoding/DECODING_SECRET_KEY_bls_const": 204.2166666666664,
    "encoding/DECODING_SECRET_KEY_ed25519_const": 63.93666666666646,
    "encoding/DECODING_SECRET_KEY_p256_const": 77.66999999999977,
    "encoding/DECODING_SECRET_KEY_secp256k1_const": 260.8766666666663,
    "encoding/DECODING_SIGNATURE_bls_const": 40,
    "encoding/DECODING_SIGNATURE_ed25519_const": 35,
    "encoding/DECODING_SIGNATURE_p256_const": 35,
    "encoding/DECODING_SIGNATURE_secp256k1_const": 35,
    "encoding/DECODING_STRING_LIST_ADVERSARIAL_coeff": 16.62863595418259,
    "encoding/DECODING_STRING_LIST_ADVERSARIAL_const": 0,
    "encoding/DECODING_STRING_coeff": 0.05743526369887405,
    "encoding/DECODING_STRING_const": 0,
    "encoding/ENCODING_BLS_FR_const": 80,
    "encoding/ENCODING_BLS_G1_const": 3200,
    "encoding/ENCODING_BLS_G2_const": 3900,
    "encoding/ENCODING_CHAIN_ID_const": 50,
    "encoding/ENCODING_Chest_coeff": 0.09375,
    "encoding/ENCODING_Chest_const": 6250,
    "encoding/ENCODING_Chest_key_const": 15900,
    "encoding/ENCODING_INT_coeff": 23.82659459342325,
    "encoding/ENCODING_INT_const": 0,
    "encoding/ENCODING_MICHELINE_micheline_bytes": 33,
    "encoding/ENCODING_MICHELINE_micheline_int_bytes": 25,
    "encoding/ENCODING_MICHELINE_micheline_string_bytes": 10,
    "encoding/ENCODING_MICHELINE_micheline_traversal": 100,
    "encoding/ENCODING_NAT_coeff": 23.4173929891917,
    "encoding/ENCODING_NAT_const": 0,
    "encoding/ENCODING_PUBLIC_KEY_HASH_bls_const": 80,
    "encoding/ENCODING_PUBLIC_KEY_HASH_ed25519_const": 70,
    "encoding/ENCODING_PUBLIC_KEY_HASH_p256_const": 70,
    "encoding/ENCODING_PUBLIC_KEY_HASH_secp256k1_const": 70,
    "encoding/ENCODING_PUBLIC_KEY_bls_const": 90,
    "encoding/ENCODING_PUBLIC_KEY_ed25519_const": 80,
    "encoding/ENCODING_PUBLIC_KEY_p256_const": 90,
    "encoding/ENCODING_PUBLIC_KEY_secp256k1_const": 455,
    "encoding/ENCODING_SECRET_KEY_bls_const": 72.52999999999977,
    "encoding/ENCODING_SECRET_KEY_ed25519_const": 68.05999999999977,
    "encoding/ENCODING_SECRET_KEY_p256_const": 72.35666666666644,
    "encoding/ENCODING_SECRET_KEY_secp256k1_const": 67.53999999999978,
    "encoding/ENCODING_SIGNATURE_bls_const": 55,
    "encoding/ENCODING_SIGNATURE_ed25519_const": 45,
    "encoding/ENCODING_SIGNATURE_p256_const": 45,
    "encoding/ENCODING_SIGNATURE_secp256k1_const": 45,
    "encoding/ENCODING_STRING_LIST_ADVERSARIAL_coeff": 8.42552074286036,
    "encoding/ENCODING_STRING_LIST_ADVERSARIAL_const": 0,
    "encoding/ENCODING_STRING_coeff": 0.126023131482347,
    "encoding/ENCODING_STRING_const": 0,
    "encoding/TIMESTAMP_READABLE_DECODING_coeff": 0.046875,
    "encoding/TIMESTAMP_READABLE_DECODING_const": 105,
    "encoding/TIMESTAMP_READABLE_ENCODING_const": 820,
    "global_constants_storage/Script_expr_hash_of_b58check_opt/coeff": 0,
    "global_constants_storage/Script_expr_hash_of_b58check_opt/intercept": 3171.423333333345,
    "global_constants_storage/Set_add/coeff": 6.44399585036958,
    "global_constants_storage/Set_elements/coeff": 3.273052670053711,
    "global_constants_storage/expand_constant_branch/coeff": 4095,
    "global_constants_storage/expand_no_constant_branch/coeff": 4.639474,
    "global_constants_storage/expand_no_constant_branch/intercept": 100,
    "global_constants_storage/expr_to_address_in_context/coeff": 1.25,
    "interpreter/N_IAbs_int_coeff": 0.5,
    "interpreter/N_IAbs_int_const": 20,
    "interpreter/N_IAdd_bls12_381_fr_const": 30,
    "interpreter/N_IAdd_bls12_381_g1_const": 900,
    "interpreter/N_IAdd_bls12_381_g2_const": 2470,
    "interpreter/N_IAdd_int_coeff": 0.5,
    "interpreter/N_IAdd_int_const": 35,
    "interpreter/N_IAdd_nat_coeff": 0.5,
    "interpreter/N_IAdd_nat_const": 35,
    "interpreter/N_IAdd_seconds_to_timestamp_coeff": 0.5,
    "interpreter/N_IAdd_seconds_to_timestamp_const": 35,
    "interpreter/N_IAdd_tez_const": 20,
    "interpreter/N_IAdd_timestamp_to_seconds_coeff": 0.5,
    "interpreter/N_IAdd_timestamp_to_seconds_const": 35,
    "interpreter/N_IAddress_const": 10,
    "interpreter/N_IAmount_const": 10,
    "interpreter/N_IAnd_bytes_coeff": 0.5,
    "interpreter/N_IAnd_bytes_const": 35,
    "interpreter/N_IAnd_const": 10,
    "interpreter/N_IAnd_int_nat_coeff": 0.5,
    "interpreter/N_IAnd_int_nat_const": 35,
    "interpreter/N_IAnd_nat_coeff": 0.5,
    "interpreter/N_IAnd_nat_const": 35,
    "interpreter/N_IApply_lam": 140,
    "interpreter/N_IApply_lamrec": 220,
    "interpreter/N_IBalance_const": 10,
    "interpreter/N_IBig_map_get_and_update_coeff": 2.842646848581943,
    "interpreter/N_IBig_map_get_and_update_const": 834.6338760079894,
    "interpreter/N_IBig_map_get_coeff": 2.843415644317873,
    "interpreter/N_IBig_map_get_const": 822.9305426746561,
    "interpreter/N_IBig_map_mem_coeff": 2.843652859797409,
    "interpreter/N_IBig_map_mem_const": 824.7038760079895,
    "interpreter/N_IBig_map_update_coeff": 3.161812799978645,
    "interpreter/N_IBig_map_update_const": 816.0205426746561,
    "interpreter/N_IBlake2b_coeff": 1.125,
    "interpreter/N_IBlake2b_const": 430,
    "interpreter/N_IBytes_int_coeff": 3,
    "interpreter/N_IBytes_int_const": 90,
    "interpreter/N_IBytes_nat_coeff": 3,
    "interpreter/N_IBytes_nat_const": 75,
    "interpreter/N_IBytes_size_const": 10,
    "interpreter/N_ICar_const": 10,
    "interpreter/N_ICdr_const": 10,
    "interpreter/N_IChainId_const": 15,
    "interpreter/N_ICheck_signature_bls_coeff": 3,
    "interpreter/N_ICheck_signature_bls_const": 1570000,
    "interpreter/N_ICheck_signature_ed25519_coeff": 1.125,
    "interpreter/N_ICheck_signature_ed25519_const": 65800,
    "interpreter/N_ICheck_signature_p256_coeff": 1.125,
    "interpreter/N_ICheck_signature_p256_const": 341000,
    "interpreter/N_ICheck_signature_secp256k1_coeff": 1.125,
    "interpreter/N_ICheck_signature_secp256k1_const": 51600,
    "interpreter/N_IComb_coeff": 3.25,
    "interpreter/N_IComb_const": 40,
    "interpreter/N_IComb_get_coeff": 0.5625,
    "interpreter/N_IComb_get_const": 20,
    "interpreter/N_IComb_set_coeff": 1.28125,
    "interpreter/N_IComb_set_const": 30,
    "interpreter/N_ICompare_coeff": 0.0234375,
    "interpreter/N_ICompare_const": 35,
    "interpreter/N_IConcat_bytes_const": 31.02720934132395,
    "interpreter/N_IConcat_bytes_list_length": 0.08531904945967994,
    "interpreter/N_IConcat_bytes_pair_coeff": 0.5,
    "interpreter/N_IConcat_bytes_pair_const": 45,
    "interpreter/N_IConcat_bytes_total_bytes": 0,
    "interpreter/N_IConcat_string_const": 33.83720934132398,
    "interpreter/N_IConcat_string_list_length": 0.08972387550704279,
    "interpreter/N_IConcat_string_pair_coeff": 0.5,
    "interpreter/N_IConcat_string_pair_const": 45,
    "interpreter/N_IConcat_string_total_bytes": 0,
    "interpreter/N_ICons_list_const": 10,
    "interpreter/N_ICons_none_const": 10,
    "interpreter/N_ICons_pair_const": 10,
    "interpreter/N_ICons_some_const": 10,
    "interpreter/N_IContract_const": 30,
    "interpreter/N_ICreate_contract_const": 60,
    "interpreter/N_IDiff_timestamps_coeff": 0.5,
    "interpreter/N_IDiff_timestamps_const": 35,
    "interpreter/N_IDig_coeff": 6.75,
    "interpreter/N_IDig_const": 30,
    "interpreter/N_IDipN_coeff": 4,
    "interpreter/N_IDipN_const": 15,
    "interpreter/N_IDip_const": 10,
    "interpreter/N_IDropN_coeff1": 2.625,
    "interpreter/N_IDropN_coeff2": 8.741624784215688,
    "interpreter/N_IDropN_coeff3": 3.269942503929978,
    "interpreter/N_IDropN_const": 30,
    "interpreter/N_IDrop_const": 10,
    "interpreter/N_IDug_coeff": 6.75,
    "interpreter/N_IDug_const": 35,
    "interpreter/N_IDupN_coeff1": 1.25,
    "interpreter/N_IDupN_coeff2": 4.809443771596645,
    "interpreter/N_IDupN_coeff3": 2.137595916463435,
    "interpreter/N_IDupN_const": 20,
    "interpreter/N_IDup_const": 10,
    "interpreter/N_IEdiv_int_const": 150,
    "interpreter/N_IEdiv_int_q_coeff": 12,
    "interpreter/N_IEdiv_int_q_size2_coeff": 0.0010986328125,
    "interpreter/N_IEdiv_int_size1_coeff": 1.25,
    "interpreter/N_IEdiv_nat_const": 150,
    "interpreter/N_IEdiv_nat_q_coeff": 12,
    "interpreter/N_IEdiv_nat_q_size2_coeff": 0.0010986328125,
    "interpreter/N_IEdiv_nat_size1_coeff": 1.25,
    "interpreter/N_IEdiv_tez_const": 80,
    "interpreter/N_IEdiv_teznat_const": 70,
    "interpreter/N_IEmit_const": 30,
    "interpreter/N_IEmpty_big_map_const": 300,
    "interpreter/N_IEmpty_map_const": 300,
    "interpreter/N_IEmpty_set_const": 300,
    "interpreter/N_IEq_const": 10,
    "interpreter/N_IExec_const": 10,
    "interpreter/N_IFailwith_const": 167.4551906586758,
    "interpreter/N_IGe_const": 10,
    "interpreter/N_IGt_const": 10,
    "interpreter/N_IHalt_alloc_const": 0,
    "interpreter/N_IHalt_const": 15,
    "interpreter/N_IHash_key_const": 605,
    "interpreter/N_IIf_cons_const": 10,
    "interpreter/N_IIf_const": 10,
    "interpreter/N_IIf_left_const": 10,
    "interpreter/N_IIf_none_const": 10,
    "interpreter/N_IImplicit_account_const": 10,
    "interpreter/N_IInt_bls12_381_z_fr_const": 115,
    "interpreter/N_IInt_bytes_coeff": 2.5,
    "interpreter/N_IInt_bytes_const": 20,
    "interpreter/N_IInt_nat_const": 10,
    "interpreter/N_IIs_nat_const": 10,
    "interpreter/N_IJoin_tickets_add_coeff": 0.07889348241253691,
    "interpreter/N_IJoin_tickets_compare_coeff": 0,
    "interpreter/N_IJoin_tickets_const": 88.17054267465751,
    "interpreter/N_IKeccak_coeff": 8.25,
    "interpreter/N_IKeccak_const": 1350,
    "interpreter/N_ILambda_lam_const": 10,
    "interpreter/N_ILambda_lamrec_const": 10,
    "interpreter/N_ILe_const": 10,
    "interpreter/N_ILeft_const": 10,
    "interpreter/N_ILevel_const": 10,
    "interpreter/N_IList_iter_const": 20,
    "interpreter/N_IList_map_const": 20,
    "interpreter/N_IList_size_const": 10,
    "interpreter/N_ILoop_in_const": 10,
    "interpreter/N_ILoop_left_in_const": 10,
    "interpreter/N_ILoop_left_out_const": 10,
    "interpreter/N_ILoop_out_const": 1.014518682647915,
    "interpreter/N_ILsl_bytes_bytes": 0.75,
    "interpreter/N_ILsl_bytes_const": 65,
    "interpreter/N_ILsl_bytes_shift": 0.0625,
    "interpreter/N_ILsl_nat_coeff": 0.5,
    "interpreter/N_ILsl_nat_const": 128,
    "interpreter/N_ILsr_bytes_coeff": 0.75,
    "interpreter/N_ILsr_bytes_const": 55,
    "interpreter/N_ILsr_nat_coeff": 0.5,
    "interpreter/N_ILsr_nat_const": 45,
    "interpreter/N_ILt_const": 10,
    "interpreter/N_IMap_get_and_update_coeff": 0.140625,
    "interpreter/N_IMap_get_and_update_const": 75,
    "interpreter/N_IMap_get_coeff": 0.046875,
    "interpreter/N_IMap_get_const": 45,
    "interpreter/N_IMap_iter_coeff": 7.625,
    "interpreter/N_IMap_iter_const": 50,
    "interpreter/N_IMap_map_coeff": 8.5,
    "interpreter/N_IMap_map_const": 40,
    "interpreter/N_IMap_mem_coeff": 0.046875,
    "interpreter/N_IMap_mem_const": 45,
    "interpreter/N_IMap_size_const": 10,
    "interpreter/N_IMap_update_coeff": 0.09375,
    "interpreter/N_IMap_update_const": 55,
    "interpreter/N_IMin_block_time_const": 20,
    "interpreter/N_IMul_bls12_381_fr_const": 45,
    "interpreter/N_IMul_bls12_381_fr_z_coeff": 1.0625,
    "interpreter/N_IMul_bls12_381_fr_z_const": 265,
    "interpreter/N_IMul_bls12_381_g1_const": 103000,
    "interpreter/N_IMul_bls12_381_g2_const": 220000,
    "interpreter/N_IMul_bls12_381_z_fr_coeff": 1.0625,
    "interpreter/N_IMul_bls12_381_z_fr_const": 265,
    "interpreter/N_IMul_int_coeff": 0.8125,
    "interpreter/N_IMul_int_const": 55,
    "interpreter/N_IMul_nat_coeff": 0.8125,
    "interpreter/N_IMul_nat_const": 55,
    "interpreter/N_IMul_nattez_const": 50,
    "interpreter/N_IMul_teznat_const": 50,
    "interpreter/N_INat_bytes_coeff": 2.5,
    "interpreter/N_INat_bytes_const": 45,
    "interpreter/N_INeg_bls12_381_fr_const": 30,
    "interpreter/N_INeg_bls12_381_g1_const": 50,
    "interpreter/N_INeg_bls12_381_g2_const": 70,
    "interpreter/N_INeg_coeff": 0.5,
    "interpreter/N_INeg_const": 25,
    "interpreter/N_INeq_const": 10,
    "interpreter/N_INil_const": 10,
    "interpreter/N_INot_bytes_coeff": 0.5,
    "interpreter/N_INot_bytes_const": 30,
    "interpreter/N_INot_const": 10,
    "interpreter/N_INot_int_coeff": 0.5,
    "interpreter/N_INot_int_const": 25,
    "interpreter/N_INow_const": 10,
    "interpreter/N_IOpen_chest_const": 919000,
    "interpreter/N_IOpen_chest_log_time_coeff": 22528,
    "interpreter/N_IOpen_chest_plaintext_coeff": 3.25,
    "interpreter/N_IOpt_map_none_const": 10,
    "interpreter/N_IOpt_map_some_const": 0,
    "interpreter/N_IOr_bytes_coeff": 0.5,
    "interpreter/N_IOr_bytes_const": 35,
    "interpreter/N_IOr_const": 10,
    "interpreter/N_IOr_nat_coeff": 0.5,
    "interpreter/N_IOr_nat_const": 35,
    "interpreter/N_IPack_micheline_nodes": 391.2538760079897,
    "interpreter/N_IPairing_check_bls12_381_coeff": 342500,
    "interpreter/N_IPairing_check_bls12_381_const": 450000,
    "interpreter/N_IPush_const": 10,
    "interpreter/N_IRead_ticket_const": 10,
    "interpreter/N_IRight_const": 10,
    "interpreter/N_ISapling_empty_state_const": 300,
    "interpreter/N_ISapling_verify_update_const": 432500,
    "interpreter/N_ISapling_verify_update_inputs": 5740000,
    "interpreter/N_ISapling_verify_update_outputs": 4636500,
    "interpreter/N_ISelf_address_const": 10,
    "interpreter/N_ISelf_const": 10,
    "interpreter/N_ISender_const": 10,
    "interpreter/N_ISet_delegate_const": 60,
    "interpreter/N_ISet_iter_coeff": 7.625,
    "interpreter/N_ISet_iter_const": 50,
    "interpreter/N_ISet_mem_coeff": 0.0564536354585845,
    "interpreter/N_ISet_mem_const": 39.38054267465736,
    "interpreter/N_ISet_size_const": 10,
    "interpreter/N_ISet_update_coeff": 0.1400362076631439,
    "interpreter/N_ISet_update_const": 49.89054267465742,
    "interpreter/N_ISha256_coeff": 4.75,
    "interpreter/N_ISha256_const": 600,
    "interpreter/N_ISha3_coeff": 8.25,
    "interpreter/N_ISha3_const": 1350,
    "interpreter/N_ISha512_coeff": 3,
    "interpreter/N_ISha512_const": 680,
    "interpreter/N_ISlice_bytes_coeff": 0.5,
    "interpreter/N_ISlice_bytes_const": 25,
    "interpreter/N_ISlice_string_coeff": 0.5,
    "interpreter/N_ISlice_string_const": 25,
    "interpreter/N_ISource_const": 10,
    "interpreter/N_ISplit_ticket_coeff": 0.5,
    "interpreter/N_ISplit_ticket_const": 40,
    "interpreter/N_IString_size_const": 15,
    "interpreter/N_ISub_int_coeff": 0.5,
    "interpreter/N_ISub_int_const": 35,
    "interpreter/N_ISub_tez_const": 15,
    "interpreter/N_ISub_tez_legacy_const": 20,
    "interpreter/N_ISub_timestamp_seconds_coeff": 0.5,
    "interpreter/N_ISub_timestamp_seconds_const": 35,
    "interpreter/N_ISwap_const": 10,
    "interpreter/N_ITicket_const": 10,
    "interpreter/N_ITotal_voting_power_const": 450,
    "interpreter/N_ITransfer_tokens_const": 60,
    "interpreter/N_IUncomb_coeff": 4,
    "interpreter/N_IUncomb_const": 30,
    "interpreter/N_IUnit_const": 10,
    "interpreter/N_IUnpack_const": 278.7605426746565,
    "interpreter/N_IUnpair_const": 10,
    "interpreter/N_IView_const": 1460,
    "interpreter/N_IVoting_power_const": 640,
    "interpreter/N_IXor_bytes_coeff": 0.5,
    "interpreter/N_IXor_bytes_const": 40,
    "interpreter/N_IXor_const": 15,
    "interpreter/N_IXor_nat_coeff": 0.5,
    "interpreter/N_IXor_nat_const": 35,
    "interpreter/N_KCons_const": 10,
    "interpreter/N_KIter_empty_const": 10,
    "interpreter/N_KIter_nonempty_const": 10,
    "interpreter/N_KList_enter_body_coeff": 1.8125,
    "interpreter/N_KList_enter_body_const": 30,
    "interpreter/N_KList_enter_body_iter": 30,
    "interpreter/N_KList_exit_body_const": 10,
    "interpreter/N_KLoop_in_const": 10,
    "interpreter/N_KLoop_in_left_const": 10,
    "interpreter/N_KMap_enter_body_empty": 10,
    "interpreter/N_KMap_enter_body_nonempty": 80,
    "interpreter/N_KMap_exit_body_coeff": 0.1149644278432145,
    "interpreter/N_KMap_exit_body_const": 0,
    "interpreter/N_KMap_head_const": 20,
    "interpreter/N_KNil_const": 15,
    "interpreter/N_KReturn_const": 10,
    "interpreter/N_KUndip_const": 10,
    "interpreter/N_KView_exit_const": 20,
    "interpreter/amplification_loop_iteration": 0.3293093413239112,
    "micheline/nodes": 51,
    "misc/lwt_main_run": 49.40666666666652,
    "sapling/apply_diff_const": 1300000,
    "sapling/apply_diff_inputs": 5000,
    "sapling/apply_diff_outputs": 55000,
    "sc_rollup/Sc_rollup_deserialize_output_proof_benchmark/coeff": 6,
    "sc_rollup/Sc_rollup_deserialize_output_proof_benchmark/intercept": 7100,
    "sc_rollup/Sc_rollup_install_boot_sector_benchmark/coeff": 3.5,
    "sc_rollup/Sc_rollup_install_boot_sector_benchmark/intercept": 13550,
    "sc_rollup/Sc_rollup_verify_output_proof_benchmark/coeff": 7,
    "sc_rollup/Sc_rollup_verify_output_proof_benchmark/intercept": 103450,
    "script_repr/MICHELINE_NODES_const": 0,
    "script_repr/MICHELINE_NODES_ns_per_node_coeff": 6.492852150095166,
    "script_repr/nodes": 51,
    "script_typed_ir_size/KINSTR_SIZE_const": 0,
    "script_typed_ir_size/KINSTR_SIZE_size_coeff": 16.91072877942451,
    "script_typed_ir_size/NODE_SIZE_const": 0,
    "script_typed_ir_size/NODE_SIZE_ns_per_node_coeff": 25.39689742685013,
    "script_typed_ir_size/TYPE_SIZE_const": 0,
    "script_typed_ir_size/TYPE_SIZE_size_coeff": 16.22325067098085,
    "script_typed_ir_size/VALUE_SIZE_const": 0,
    "script_typed_ir_size/VALUE_SIZE_size_coeff": 19.56988810741499,
    "skip_list/hash_cell/coeff": 57,
    "skip_list/hash_cell/intercept": 250,
    "skip_list/next/coeff": 20,
    "storage/list_key_values_intercept": 470,
    "storage/list_key_values_step": 117,
    "tickets/COLLECT_TICKETS_STEP/coeff": 80,
    "tickets/COLLECT_TICKETS_STEP/intercept": 0,
    "tickets/TYPE_HAS_TICKETS/coeff": 6,
    "tickets/TYPE_HAS_TICKETS/intercept": 10,
    "tickets/compare_contract": 10,
    "tickets/compare_ticket_hash": 10,
    "translator/PARSE_TYPE/coeff": 60,
    "translator/PARSE_TYPE/intercept": 0,
    "translator/Parsing_Code_gas_coeff": 0.8903912445671381,
    "translator/Parsing_Code_gas_const": 0,
    "translator/Parsing_Code_size_int_bytes": 0,
    "translator/Parsing_Code_size_string_bytes": 0,
    "translator/Parsing_Code_size_traversal": 187.3004589673066,
    "translator/Parsing_Data_gas_coeff": 0.1429729867508994,
    "translator/Parsing_Data_gas_const": 67277.39739401177,
    "translator/Parsing_Data_size_int_bytes": 16.14268057774883,
    "translator/Parsing_Data_size_string_bytes": 68.94873206863673,
    "translator/Parsing_Data_size_traversal": 80.36344489900098,
    "translator/TY_EQ/coeff": 60,
    "translator/TY_EQ/intercept": 0,
    "translator/UNPARSE_TYPE/coeff": 20,
    "translator/UNPARSE_TYPE/intercept": 0,
    "translator/Unparsing_Code_gas_coeff": 0.5923099246608585,
    "translator/Unparsing_Code_gas_const": 0,
    "translator/Unparsing_Code_size_int_bytes": 0,
    "translator/Unparsing_Code_size_string_bytes": 0,
    "translator/Unparsing_Code_size_traversal": 124.7264251200329,
    "translator/Unparsing_Data_gas_coeff": 0.03386230569199927,
    "translator/Unparsing_Data_gas_const": 31944.78653843506,
    "translator/Unparsing_Data_size_int_bytes": 0,
    "translator/Unparsing_Data_size_string_bytes": 0,
    "translator/Unparsing_Data_size_traversal": 54.87066469329662
  },
  "scores_list": []
}
