
./octez-client --protocol ProtoALphaALphaALphaALphaALphaALphaALphaALphaDdp3zK --mode mockup --no-base-dir-warnings run script michelson_test_scripts/opcodes/shifts.tz on storage None and input '(Right (Pair 0 1))' --level 1 --trace-stack
storage
  (Some 0)
emitted operations
  
big_map diff
  
trace
  - location: 14 (just consumed gas: 8.653)
    [ (Pair (Right (Pair 0 1)) None) ]
  - location: 14 (just consumed gas: 0.010)
    [ (Right (Pair 0 1)) ]
  - location: 15 (just consumed gas: 0.010)
    [ (Pair 0 1) ]
  - location: 20 (just consumed gas: 0.010)
    [ 0
      1 ]
  - location: 21 (just consumed gas: 0.045)
    [ 0 ]
  - location: 15 (just consumed gas: 0.025)
    [ 0 ]
  - location: 22 (just consumed gas: 0.010)
    [ (Some 0) ]
  - location: 23 (just consumed gas: 0.010)
    [ {}
      (Some 0) ]
  - location: 25 (just consumed gas: 0.010)
    [ (Pair {} (Some 0)) ]

