
./octez-client --mode mockup --wait none originate contract tickets_send transferring 0 from bootstrap1 running michelson_test_scripts/mini_scenarios/tickets_send_016.tz --init Unit --burn-cap 1
Node is bootstrapped.
Estimated gas: 614.130 units (will add 100 for safety)
Estimated storage: 415 bytes added (will add 20 for safety)
Operation successfully injected in the node.
Operation hash is '[OPERATION_HASH]'
NOT waiting for the operation to be included.
Use command
  octez-client wait for [OPERATION_HASH] to be included --confirmations 1 --branch [BLOCK_HASH]
and/or an external block explorer to make sure that it has been included.
This sequence of operations was run:
  Manager signed operations:
    From: [PUBLIC_KEY_HASH]
    Fee to the baker: ꜩ0.000457
    Expected counter: 1
    Gas limit: 715
    Storage limit: 435 bytes
    Balance updates:
      [PUBLIC_KEY_HASH] ... -ꜩ0.000457
      payload fees(the block proposer) ....... +ꜩ0.000457
    Origination:
      From: [PUBLIC_KEY_HASH]
      Credit: ꜩ0
      Script:
        { parameter (pair address nat) ;
          storage unit ;
          code { CAR ;
                 UNPAIR ;
                 CONTRACT (ticket string) ;
                 IF_NONE
                   { PUSH string "Contract not found" ; FAILWITH }
                   { PUSH mutez 0 ;
                     DIG 2 ;
                     PUSH string "Ticket" ;
                     TICKET ;
                     ASSERT_SOME ;
                     TRANSFER_TOKENS ;
                     PUSH unit Unit ;
                     NIL operation ;
                     DIG 2 ;
                     CONS ;
                     PAIR } } }
        Initial storage: Unit
        No delegate for this contract
        This origination was successfully applied
        Originated contracts:
          [CONTRACT_HASH]
        Storage size: 158 bytes
        Paid storage size diff: 158 bytes
        Consumed gas: 614.097
        Balance updates:
          [PUBLIC_KEY_HASH] ... -ꜩ0.0395
          storage fees ........................... +ꜩ0.0395
          [PUBLIC_KEY_HASH] ... -ꜩ0.06425
          storage fees ........................... +ꜩ0.06425

New contract [CONTRACT_HASH] originated.
Contract memorized as tickets_send.

./octez-client --mode mockup --wait none originate contract tickets_blackhole transferring 0 from bootstrap1 running michelson_test_scripts/mini_scenarios/tickets_blackhole_016.tz --init Unit --burn-cap 1
Node is bootstrapped.
Estimated gas: 579.688 units (will add 100 for safety)
Estimated storage: 308 bytes added (will add 20 for safety)
Operation successfully injected in the node.
Operation hash is '[OPERATION_HASH]'
NOT waiting for the operation to be included.
Use command
  octez-client wait for [OPERATION_HASH] to be included --confirmations 1 --branch [BLOCK_HASH]
and/or an external block explorer to make sure that it has been included.
This sequence of operations was run:
  Manager signed operations:
    From: [PUBLIC_KEY_HASH]
    Fee to the baker: ꜩ0.000346
    Expected counter: 2
    Gas limit: 680
    Storage limit: 328 bytes
    Balance updates:
      [PUBLIC_KEY_HASH] ... -ꜩ0.000346
      payload fees(the block proposer) ....... +ꜩ0.000346
    Origination:
      From: [PUBLIC_KEY_HASH]
      Credit: ꜩ0
      Script:
        { parameter (ticket %ticket string) ;
          storage unit ;
          code { CDR ; NIL operation ; PAIR } }
        Initial storage: Unit
        No delegate for this contract
        This origination was successfully applied
        Originated contracts:
          [CONTRACT_HASH]
        Storage size: 51 bytes
        Paid storage size diff: 51 bytes
        Consumed gas: 579.655
        Balance updates:
          [PUBLIC_KEY_HASH] ... -ꜩ0.01275
          storage fees ........................... +ꜩ0.01275
          [PUBLIC_KEY_HASH] ... -ꜩ0.06425
          storage fees ........................... +ꜩ0.06425

New contract [CONTRACT_HASH] originated.
Contract memorized as tickets_blackhole.

./octez-client --mode mockup --wait none transfer 0 from bootstrap1 to '[CONTRACT_HASH]' --burn-cap 1 --arg 'Pair "[PUBLIC_KEY_HASH]" 1'
Node is bootstrapped.
Estimated gas: 1858.607 units (will add 100 for safety)
Estimated storage: 66 bytes added (will add 20 for safety)
Operation successfully injected in the node.
Operation hash is '[OPERATION_HASH]'
NOT waiting for the operation to be included.
Use command
  octez-client wait for [OPERATION_HASH] to be included --confirmations 1 --branch [BLOCK_HASH]
and/or an external block explorer to make sure that it has been included.
This sequence of operations was run:
  Manager signed operations:
    From: [PUBLIC_KEY_HASH]
    Fee to the baker: ꜩ0.000494
    Expected counter: 3
    Gas limit: 1959
    Storage limit: 86 bytes
    Balance updates:
      [PUBLIC_KEY_HASH] ... -ꜩ0.000494
      payload fees(the block proposer) ....... +ꜩ0.000494
    Transaction:
      Amount: ꜩ0
      From: [PUBLIC_KEY_HASH]
      To: [CONTRACT_HASH]
      Parameter: (Pair "[PUBLIC_KEY_HASH]" 1)
      This transaction was successfully applied
      Updated storage: Unit
      Storage size: 158 bytes
      Paid storage size diff: 66 bytes
      Consumed gas: 1758.744
      Balance updates:
        [PUBLIC_KEY_HASH] ... -ꜩ0.0165
        storage fees ........................... +ꜩ0.0165
      Internal operations:
        Internal Transaction:
          Amount: ꜩ0
          From: [CONTRACT_HASH]
          To: [PUBLIC_KEY_HASH]
          Parameter: (Pair 0x01fca241ad513615858a813a6019c5a5b3977c27dc00 (Pair "Ticket" 1))
          This transaction was successfully applied
          Consumed gas: 100.398
          Ticket updates:
            Ticketer: [CONTRACT_HASH]
            Content type: string
            Content: "Ticket"
            Account updates:
              [PUBLIC_KEY_HASH] ... +1


./octez-client --mode mockup --wait none transfer 0 from bootstrap1 to '[CONTRACT_HASH]' --burn-cap 1 --arg 'Pair "[CONTRACT_HASH]" 1'
Node is bootstrapped.
Estimated gas: 4063.772 units (will add 100 for safety)
Estimated storage: 66 bytes added (will add 20 for safety)
Operation successfully injected in the node.
Operation hash is '[OPERATION_HASH]'
NOT waiting for the operation to be included.
Use command
  octez-client wait for [OPERATION_HASH] to be included --confirmations 1 --branch [BLOCK_HASH]
and/or an external block explorer to make sure that it has been included.
This sequence of operations was run:
  Manager signed operations:
    From: [PUBLIC_KEY_HASH]
    Fee to the baker: ꜩ0.000715
    Expected counter: 4
    Gas limit: 4164
    Storage limit: 86 bytes
    Balance updates:
      [PUBLIC_KEY_HASH] ... -ꜩ0.000715
      payload fees(the block proposer) ....... +ꜩ0.000715
    Transaction:
      Amount: ꜩ0
      From: [PUBLIC_KEY_HASH]
      To: [CONTRACT_HASH]
      Parameter: (Pair "[CONTRACT_HASH]" 1)
      This transaction was successfully applied
      Updated storage: Unit
      Storage size: 158 bytes
      Paid storage size diff: 66 bytes
      Consumed gas: 2211.193
      Balance updates:
        [PUBLIC_KEY_HASH] ... -ꜩ0.0165
        storage fees ........................... +ꜩ0.0165
      Internal operations:
        Internal Transaction:
          Amount: ꜩ0
          From: [CONTRACT_HASH]
          To: [CONTRACT_HASH]
          Parameter: (Pair 0x01fca241ad513615858a813a6019c5a5b3977c27dc00 (Pair "Ticket" 1))
          This transaction was successfully applied
          Updated storage: Unit
          Storage size: 51 bytes
          Consumed gas: 1853.630

