{
  "home": [
    {
      "id": 1,
      "name": "andrea",
      "lastname": "campos.",
      "description": "hi, I'm front end developer!"
    }
  ],
  "about": [
    {
      "id": 1,
      "img": {
        "url": "../assets/img/aboutme.jpg",
        "alt": "Andrea Campos"
      },
      "title": "about andrea.",
      "description": "a year ago I changed the course of my life and decided to start studying web development. I'm currently training in the Upgrade-Hub bootcampt as Front End Developer, acquiring HTML, CSS, JavaScript, Angular and React skills, among others. Also I'm working as a Front End at Frenetic, a booming tech startup."
    }
  ],
  "skills": [
    {
      "id": 1,
      "img": {
        "url": "../assets/img/html.svg",
        "alt": "html skill image"
      },
      "title": "html",
      "description": "the structure of any website, handling Flexbox and Grid CSS Layout"
    },
    {
      "id": 2,
      "img": {
        "url": "../assets/img/css.svg",
        "alt": "css skill image"
      },
      "title": "css",
      "description": "to make cool your website with BEM, preprocessors like SASS and SCSS, bootstrap..."
    },
    {
      "id": 3,
      "img": {
        "url": "../assets/img/javascript.svg",
        "alt": "js skill image"
      },
      "title": "JavaScript",
      "description": "making your website dynamic since 1996 (ES6, OOP, FP...)"
    },
    {
      "id": 4,
      "img": {
        "url": "../assets/img/angular.svg",
        "alt": "angular skill image"
      },
      "title": "Angular",
      "description": "your favorite framework (sorry React), using TypeScript life is better"
    },
    {
      "id": 5,
      "img": {
        "url": "../assets/img/react.svg",
        "alt": "react skill image"
      },
      "title": "React",
      "description": "to be continued..."
    }
  ],
  "newMessage": [
    {
      "name": "Andrea",
      "mail": "andrea.campos96@hotmail.com",
      "age": 24,
      "message": "Esto es una prueba para comprobar que el formulario post funciona :)",
      "id": 1
    },
    {
      "name": "Andrea Campos Cardiel",
      "mail": "andrea.campos96@hotmail.com",
      "age": "22",
      "message": "qwedrft",
      "id": 2
    }
  ]
}