S=>aSc=>aIc=>aaIbc=>aabc

                        MANGIA                                   MANGIA
(q0,aabc,S)->(q0,aabc,aSc)->(q0,abc,Sc)->(q0,abc,Ic)->(q0,abc,aIbc)->
 
                     MANGIA    MANGIA
(q0,bc,Ibc)->(q0,bc,bc)->(q0,c,c)->(q0,\epsilon,\epsilon)



