{
    "App": {
        "m": [
            {
                "altKey": true,
                "action": "SET_VIEW:MARKDOWN"
            },
            {
                "shiftKey": true,
                "altKey": true,
                "action": "SWITCH_DARK_MODE"
            }
        ],
        "f": [
            {
                "altKey": true,
                "action": "SET_VIEW:FORMATTED"
            }
        ],
        "e": [
            {
                "altKey": true,
                "action": "SET_VIEW:TOGGLE"
            }
        ],
        "b": [
            {
                "altKey": true,
                "action": "SET_VIEW:SIDE-BY-SIDE"
            }
        ],
        "t": [
            { 
                "action": "FOCUS_ON_TREE",
                "ctrlOrCommandKey": true,
                "shiftKey": true
            }
        ]
    },
    "App/TreeView/ItemLabel": {
        "ArrowUp": [
            { "action": "NAVIGATE_TREE_UP" }
        ],
        "ArrowDown": [
            { "action": "NAVIGATE_TREE_DOWN" }
        ],
        "Enter": [
            { "action": "EDIT_NODE_NAME" }
        ]
    },
    "App/TreeView/ItemLabel/Dir": {
        "ArrowRight": [
            { "action": "EXPAND_DIR_NODE" }
        ],
        "ArrowLeft": [
            { "action": "COLLAPSE_DIR_NODE" }
        ]
    }
}