Book ID,Title,Author,Year
BK1000,Title 0,Author 6,1931
BK1001,Title 1,Author 3,1940
BK1002,Title 2,Author 6,1943
BK1003,Title 3,Author 8,1903
BK1004,Title 4,Author 7,1956
BK1005,Title 5,Author 15,1943
BK1006,Title 6,Author 9,1932
BK1007,Title 7,Author 12,1957
BK1008,Title 8,Author 1,1947
BK1009,Title 9,Author 6,1981
BK1010,Title 10,Author 16,1930
BK1011,Title 11,Author 13,1995
BK1012,Title 12,Author 4,1980
BK1013,Title 13,Author 19,1988
BK1014,Title 14,Author 4,1908
BK1015,Title 15,Author 3,1943
BK1016,Title 16,Author 12,1977
BK1017,Title 17,Author 17,1958
BK1018,Title 18,Author 6,1959
BK1019,Title 19,Author 12,2008
BK1020,Title 20,Author 12,1988
BK1021,Title 21,Author 6,1916
BK1022,Title 22,Author 13,1942
BK1023,Title 23,Author 2,2012
BK1024,Title 24,Author 16,2009
BK1025,Title 25,Author 11,1928
BK1026,Title 26,Author 3,1927
BK1027,Title 27,Author 16,2006
BK1028,Title 28,Author 9,1978
BK1029,Title 29,Author 7,1926
BK1030,Title 30,Author 2,1990
BK1031,Title 31,Author 8,1972
BK1032,Title 32,Author 5,1943
BK1033,Title 33,Author 4,1913
BK1034,Title 34,Author 8,1917
BK1035,Title 35,Author 5,1996
BK1036,Title 36,Author 14,1980
BK1037,Title 37,Author 7,1949
BK1038,Title 38,Author 2,1909
BK1039,Title 39,Author 11,1970
BK1040,Title 40,Author 18,1980
BK1041,Title 41,Author 20,1979
BK1042,Title 42,Author 15,1961
BK1043,Title 43,Author 7,1905
BK1044,Title 44,Author 14,2023
BK1045,Title 45,Author 18,1973
BK1046,Title 46,Author 11,2008
BK1047,Title 47,Author 12,1909
BK1048,Title 48,Author 10,1929
BK1049,Title 49,Author 15,1949
