Controller.Micro850.Micro850.__SYSVA_ABORT_CYCLE	
Controller.Micro850.Micro850.__SYSVA_CCEXEC	
Controller.Micro850.Micro850.__SYSVA_CYCLECNT	
Controller.Micro850.Micro850.__SYSVA_CYCLEDATE	
Controller.Micro850.Micro850.__SYSVA_FIRST_SCAN	
Controller.Micro850.Micro850.__SYSVA_KVBCERR	
Controller.Micro850.Micro850.__SYSVA_KVBPERR	
Controller.Micro850.Micro850.__SYSVA_MAJ_ERR_HALT	
Controller.Micro850.Micro850.__SYSVA_POWERUP_BIT	
Controller.Micro850.Micro850.__SYSVA_PROJ_INCOMPLETE	
Controller.Micro850.Micro850.__SYSVA_REMOTE	
Controller.Micro850.Micro850.__SYSVA_RESMODE	
Controller.Micro850.Micro850.__SYSVA_RESNAME	
Controller.Micro850.Micro850.__SYSVA_SCANCNT	
Controller.Micro850.Micro850.__SYSVA_SUSPEND_ID	
Controller.Micro850.Micro850.__SYSVA_TCYCURRENT	
Controller.Micro850.Micro850.__SYSVA_TCYCYCTIME	
Controller.Micro850.Micro850.__SYSVA_TCYMAXIMUM	
Controller.Micro850.Micro850.__SYSVA_TCYOVERFLOW	
Controller.Micro850.Micro850.__SYSVA_TCYWDG	
Controller.Micro850.Micro850.__SYSVA_USER_DATA_LOST	
Controller.Micro850.Micro850._IO_EM_DI_00	
Controller.Micro850.Micro850._IO_EM_DI_01	
Controller.Micro850.Micro850._IO_EM_DI_02	
Controller.Micro850.Micro850._IO_EM_DI_03	
Controller.Micro850.Micro850._IO_EM_DI_04	
Controller.Micro850.Micro850._IO_EM_DI_05	
Controller.Micro850.Micro850._IO_EM_DI_06	
Controller.Micro850.Micro850._IO_EM_DI_07	
Controller.Micro850.Micro850._IO_EM_DI_08	
Controller.Micro850.Micro850._IO_EM_DI_09	
Controller.Micro850.Micro850._IO_EM_DI_10	
Controller.Micro850.Micro850._IO_EM_DI_11	
Controller.Micro850.Micro850._IO_EM_DI_12	
Controller.Micro850.Micro850._IO_EM_DI_13	
Controller.Micro850.Micro850._IO_EM_DI_14	
Controller.Micro850.Micro850._IO_EM_DI_15	
Controller.Micro850.Micro850._IO_EM_DI_16	
Controller.Micro850.Micro850._IO_EM_DI_17	
Controller.Micro850.Micro850._IO_EM_DI_18	
Controller.Micro850.Micro850._IO_EM_DI_19	
Controller.Micro850.Micro850._IO_EM_DI_20	
Controller.Micro850.Micro850._IO_EM_DI_21	
Controller.Micro850.Micro850._IO_EM_DI_22	
Controller.Micro850.Micro850._IO_EM_DI_23	
Controller.Micro850.Micro850._IO_EM_DI_24	
Controller.Micro850.Micro850._IO_EM_DI_25	
Controller.Micro850.Micro850._IO_EM_DI_26	
Controller.Micro850.Micro850._IO_EM_DI_27	
Controller.Micro850.Micro850._IO_EM_DO_00	
Controller.Micro850.Micro850._IO_EM_DO_01	
Controller.Micro850.Micro850._IO_EM_DO_02	
Controller.Micro850.Micro850._IO_EM_DO_03	
Controller.Micro850.Micro850._IO_EM_DO_04	
Controller.Micro850.Micro850._IO_EM_DO_05	
Controller.Micro850.Micro850._IO_EM_DO_06	
Controller.Micro850.Micro850._IO_EM_DO_07	
Controller.Micro850.Micro850._IO_EM_DO_08	
Controller.Micro850.Micro850._IO_EM_DO_09	
Controller.Micro850.Micro850._IO_EM_DO_10	
Controller.Micro850.Micro850._IO_EM_DO_11	
Controller.Micro850.Micro850._IO_EM_DO_12	
Controller.Micro850.Micro850._IO_EM_DO_13	
Controller.Micro850.Micro850._IO_EM_DO_14	
Controller.Micro850.Micro850._IO_EM_DO_15	
Controller.Micro850.Micro850._IO_EM_DO_16	
Controller.Micro850.Micro850._IO_EM_DO_17	
Controller.Micro850.Micro850._IO_EM_DO_18	
Controller.Micro850.Micro850._IO_EM_DO_19	
Controller.Micro850.Micro850.SELF_TEST_OUTPUT.index	
Controller.Micro850.Micro850.SELF_TEST_OUTPUT.TON_1.ET	
Controller.Micro850.Micro850.SELF_TEST_OUTPUT.TON_1.IN	
Controller.Micro850.Micro850.SELF_TEST_OUTPUT.TON_1.Pdate	
Controller.Micro850.Micro850.SELF_TEST_OUTPUT.TON_1.PT	
Controller.Micro850.Micro850.SELF_TEST_OUTPUT.TON_1.Q	
Controller.Micro850.Micro850.SELF_TEST_OUTPUT.TON_1.Redge	
Controller.Micro850.Micro850.SELF_TEST_OUTPUT.TONOFF_1.ET	
Controller.Micro850.Micro850.SELF_TEST_OUTPUT.TONOFF_1.FEDGE	
Controller.Micro850.Micro850.SELF_TEST_OUTPUT.TONOFF_1.IN	
Controller.Micro850.Micro850.SELF_TEST_OUTPUT.TONOFF_1.PDATE	
Controller.Micro850.Micro850.SELF_TEST_OUTPUT.TONOFF_1.PT	
Controller.Micro850.Micro850.SELF_TEST_OUTPUT.TONOFF_1.PTOF	
Controller.Micro850.Micro850.SELF_TEST_OUTPUT.TONOFF_1.Q	
Controller.Micro850.Micro850.SELF_TEST_OUTPUT.TONOFF_1.REDGE	
Controller.Micro850.Micro850.SELT_TEST_INPUT.LIGADO	
Controller.Micro850.Micro850.SELT_TEST_INPUT.TON_1.ET	
Controller.Micro850.Micro850.SELT_TEST_INPUT.TON_1.IN	
Controller.Micro850.Micro850.SELT_TEST_INPUT.TON_1.Pdate	
Controller.Micro850.Micro850.SELT_TEST_INPUT.TON_1.PT	
Controller.Micro850.Micro850.SELT_TEST_INPUT.TON_1.Q	
Controller.Micro850.Micro850.SELT_TEST_INPUT.TON_1.Redge	
Controller.Micro850.Micro850.SELT_TEST_INPUT.TON_10.ET	
Controller.Micro850.Micro850.SELT_TEST_INPUT.TON_10.IN	
Controller.Micro850.Micro850.SELT_TEST_INPUT.TON_10.Pdate	
Controller.Micro850.Micro850.SELT_TEST_INPUT.TON_10.PT	
Controller.Micro850.Micro850.SELT_TEST_INPUT.TON_10.Q	
Controller.Micro850.Micro850.SELT_TEST_INPUT.TON_10.Redge	
Controller.Micro850.Micro850.SELT_TEST_INPUT.TON_11.ET	
Controller.Micro850.Micro850.SELT_TEST_INPUT.TON_11.IN	
Controller.Micro850.Micro850.SELT_TEST_INPUT.TON_11.Pdate	
Controller.Micro850.Micro850.SELT_TEST_INPUT.TON_11.PT	
Controller.Micro850.Micro850.SELT_TEST_INPUT.TON_11.Q	
Controller.Micro850.Micro850.SELT_TEST_INPUT.TON_11.Redge	
Controller.Micro850.Micro850.SELT_TEST_INPUT.TON_12.ET	
Controller.Micro850.Micro850.SELT_TEST_INPUT.TON_12.IN	
Controller.Micro850.Micro850.SELT_TEST_INPUT.TON_12.Pdate	
Controller.Micro850.Micro850.SELT_TEST_INPUT.TON_12.PT	
Controller.Micro850.Micro850.SELT_TEST_INPUT.TON_12.Q	
Controller.Micro850.Micro850.SELT_TEST_INPUT.TON_12.Redge	
Controller.Micro850.Micro850.SELT_TEST_INPUT.TON_13.ET	
Controller.Micro850.Micro850.SELT_TEST_INPUT.TON_13.IN	
Controller.Micro850.Micro850.SELT_TEST_INPUT.TON_13.Pdate	
Controller.Micro850.Micro850.SELT_TEST_INPUT.TON_13.PT	
Controller.Micro850.Micro850.SELT_TEST_INPUT.TON_13.Q	
Controller.Micro850.Micro850.SELT_TEST_INPUT.TON_13.Redge	
Controller.Micro850.Micro850.SELT_TEST_INPUT.TON_14.ET	
Controller.Micro850.Micro850.SELT_TEST_INPUT.TON_14.IN	
Controller.Micro850.Micro850.SELT_TEST_INPUT.TON_14.Pdate	
Controller.Micro850.Micro850.SELT_TEST_INPUT.TON_14.PT	
Controller.Micro850.Micro850.SELT_TEST_INPUT.TON_14.Q	
Controller.Micro850.Micro850.SELT_TEST_INPUT.TON_14.Redge	
Controller.Micro850.Micro850.SELT_TEST_INPUT.TON_15.ET	
Controller.Micro850.Micro850.SELT_TEST_INPUT.TON_15.IN	
Controller.Micro850.Micro850.SELT_TEST_INPUT.TON_15.Pdate	
Controller.Micro850.Micro850.SELT_TEST_INPUT.TON_15.PT	
Controller.Micro850.Micro850.SELT_TEST_INPUT.TON_15.Q	
Controller.Micro850.Micro850.SELT_TEST_INPUT.TON_15.Redge	
Controller.Micro850.Micro850.SELT_TEST_INPUT.TON_16.ET	
Controller.Micro850.Micro850.SELT_TEST_INPUT.TON_16.IN	
Controller.Micro850.Micro850.SELT_TEST_INPUT.TON_16.Pdate	
Controller.Micro850.Micro850.SELT_TEST_INPUT.TON_16.PT	
Controller.Micro850.Micro850.SELT_TEST_INPUT.TON_16.Q	
Controller.Micro850.Micro850.SELT_TEST_INPUT.TON_16.Redge	
Controller.Micro850.Micro850.SELT_TEST_INPUT.TON_17.ET	
Controller.Micro850.Micro850.SELT_TEST_INPUT.TON_17.IN	
Controller.Micro850.Micro850.SELT_TEST_INPUT.TON_17.Pdate	
Controller.Micro850.Micro850.SELT_TEST_INPUT.TON_17.PT	
Controller.Micro850.Micro850.SELT_TEST_INPUT.TON_17.Q	
Controller.Micro850.Micro850.SELT_TEST_INPUT.TON_17.Redge	
Controller.Micro850.Micro850.SELT_TEST_INPUT.TON_18.ET	
Controller.Micro850.Micro850.SELT_TEST_INPUT.TON_18.IN	
Controller.Micro850.Micro850.SELT_TEST_INPUT.TON_18.Pdate	
Controller.Micro850.Micro850.SELT_TEST_INPUT.TON_18.PT	
Controller.Micro850.Micro850.SELT_TEST_INPUT.TON_18.Q	
Controller.Micro850.Micro850.SELT_TEST_INPUT.TON_18.Redge	
Controller.Micro850.Micro850.SELT_TEST_INPUT.TON_19.ET	
Controller.Micro850.Micro850.SELT_TEST_INPUT.TON_19.IN	
Controller.Micro850.Micro850.SELT_TEST_INPUT.TON_19.Pdate	
Controller.Micro850.Micro850.SELT_TEST_INPUT.TON_19.PT	
Controller.Micro850.Micro850.SELT_TEST_INPUT.TON_19.Q	
Controller.Micro850.Micro850.SELT_TEST_INPUT.TON_19.Redge	
Controller.Micro850.Micro850.SELT_TEST_INPUT.TON_2.ET	
Controller.Micro850.Micro850.SELT_TEST_INPUT.TON_2.IN	
Controller.Micro850.Micro850.SELT_TEST_INPUT.TON_2.Pdate	
Controller.Micro850.Micro850.SELT_TEST_INPUT.TON_2.PT	
Controller.Micro850.Micro850.SELT_TEST_INPUT.TON_2.Q	
Controller.Micro850.Micro850.SELT_TEST_INPUT.TON_2.Redge	
Controller.Micro850.Micro850.SELT_TEST_INPUT.TON_20.ET	
Controller.Micro850.Micro850.SELT_TEST_INPUT.TON_20.IN	
Controller.Micro850.Micro850.SELT_TEST_INPUT.TON_20.Pdate	
Controller.Micro850.Micro850.SELT_TEST_INPUT.TON_20.PT	
Controller.Micro850.Micro850.SELT_TEST_INPUT.TON_20.Q	
Controller.Micro850.Micro850.SELT_TEST_INPUT.TON_20.Redge	
Controller.Micro850.Micro850.SELT_TEST_INPUT.TON_21.ET	
Controller.Micro850.Micro850.SELT_TEST_INPUT.TON_21.IN	
Controller.Micro850.Micro850.SELT_TEST_INPUT.TON_21.Pdate	
Controller.Micro850.Micro850.SELT_TEST_INPUT.TON_21.PT	
Controller.Micro850.Micro850.SELT_TEST_INPUT.TON_21.Q	
Controller.Micro850.Micro850.SELT_TEST_INPUT.TON_21.Redge	
Controller.Micro850.Micro850.SELT_TEST_INPUT.TON_22.ET	
Controller.Micro850.Micro850.SELT_TEST_INPUT.TON_22.IN	
Controller.Micro850.Micro850.SELT_TEST_INPUT.TON_22.Pdate	
Controller.Micro850.Micro850.SELT_TEST_INPUT.TON_22.PT	
Controller.Micro850.Micro850.SELT_TEST_INPUT.TON_22.Q	
Controller.Micro850.Micro850.SELT_TEST_INPUT.TON_22.Redge	
Controller.Micro850.Micro850.SELT_TEST_INPUT.TON_23.ET	
Controller.Micro850.Micro850.SELT_TEST_INPUT.TON_23.IN	
Controller.Micro850.Micro850.SELT_TEST_INPUT.TON_23.Pdate	
Controller.Micro850.Micro850.SELT_TEST_INPUT.TON_23.PT	
Controller.Micro850.Micro850.SELT_TEST_INPUT.TON_23.Q	
Controller.Micro850.Micro850.SELT_TEST_INPUT.TON_23.Redge	
Controller.Micro850.Micro850.SELT_TEST_INPUT.TON_24.ET	
Controller.Micro850.Micro850.SELT_TEST_INPUT.TON_24.IN	
Controller.Micro850.Micro850.SELT_TEST_INPUT.TON_24.Pdate	
Controller.Micro850.Micro850.SELT_TEST_INPUT.TON_24.PT	
Controller.Micro850.Micro850.SELT_TEST_INPUT.TON_24.Q	
Controller.Micro850.Micro850.SELT_TEST_INPUT.TON_24.Redge	
Controller.Micro850.Micro850.SELT_TEST_INPUT.TON_25.ET	
Controller.Micro850.Micro850.SELT_TEST_INPUT.TON_25.IN	
Controller.Micro850.Micro850.SELT_TEST_INPUT.TON_25.Pdate	
Controller.Micro850.Micro850.SELT_TEST_INPUT.TON_25.PT	
Controller.Micro850.Micro850.SELT_TEST_INPUT.TON_25.Q	
Controller.Micro850.Micro850.SELT_TEST_INPUT.TON_25.Redge	
Controller.Micro850.Micro850.SELT_TEST_INPUT.TON_26.ET	
Controller.Micro850.Micro850.SELT_TEST_INPUT.TON_26.IN	
Controller.Micro850.Micro850.SELT_TEST_INPUT.TON_26.Pdate	
Controller.Micro850.Micro850.SELT_TEST_INPUT.TON_26.PT	
Controller.Micro850.Micro850.SELT_TEST_INPUT.TON_26.Q	
Controller.Micro850.Micro850.SELT_TEST_INPUT.TON_26.Redge	
Controller.Micro850.Micro850.SELT_TEST_INPUT.TON_27.ET	
Controller.Micro850.Micro850.SELT_TEST_INPUT.TON_27.IN	
Controller.Micro850.Micro850.SELT_TEST_INPUT.TON_27.Pdate	
Controller.Micro850.Micro850.SELT_TEST_INPUT.TON_27.PT	
Controller.Micro850.Micro850.SELT_TEST_INPUT.TON_27.Q	
Controller.Micro850.Micro850.SELT_TEST_INPUT.TON_27.Redge	
Controller.Micro850.Micro850.SELT_TEST_INPUT.TON_28.ET	
Controller.Micro850.Micro850.SELT_TEST_INPUT.TON_28.IN	
Controller.Micro850.Micro850.SELT_TEST_INPUT.TON_28.Pdate	
Controller.Micro850.Micro850.SELT_TEST_INPUT.TON_28.PT	
Controller.Micro850.Micro850.SELT_TEST_INPUT.TON_28.Q	
Controller.Micro850.Micro850.SELT_TEST_INPUT.TON_28.Redge	
Controller.Micro850.Micro850.SELT_TEST_INPUT.TON_29.ET	
Controller.Micro850.Micro850.SELT_TEST_INPUT.TON_29.IN	
Controller.Micro850.Micro850.SELT_TEST_INPUT.TON_29.Pdate	
Controller.Micro850.Micro850.SELT_TEST_INPUT.TON_29.PT	
Controller.Micro850.Micro850.SELT_TEST_INPUT.TON_29.Q	
Controller.Micro850.Micro850.SELT_TEST_INPUT.TON_29.Redge	
Controller.Micro850.Micro850.SELT_TEST_INPUT.TON_3.ET	
Controller.Micro850.Micro850.SELT_TEST_INPUT.TON_3.IN	
Controller.Micro850.Micro850.SELT_TEST_INPUT.TON_3.Pdate	
Controller.Micro850.Micro850.SELT_TEST_INPUT.TON_3.PT	
Controller.Micro850.Micro850.SELT_TEST_INPUT.TON_3.Q	
Controller.Micro850.Micro850.SELT_TEST_INPUT.TON_3.Redge	
Controller.Micro850.Micro850.SELT_TEST_INPUT.TON_30.ET	
Controller.Micro850.Micro850.SELT_TEST_INPUT.TON_30.IN	
Controller.Micro850.Micro850.SELT_TEST_INPUT.TON_30.Pdate	
Controller.Micro850.Micro850.SELT_TEST_INPUT.TON_30.PT	
Controller.Micro850.Micro850.SELT_TEST_INPUT.TON_30.Q	
Controller.Micro850.Micro850.SELT_TEST_INPUT.TON_30.Redge	
Controller.Micro850.Micro850.SELT_TEST_INPUT.TON_4.ET	
Controller.Micro850.Micro850.SELT_TEST_INPUT.TON_4.IN	
Controller.Micro850.Micro850.SELT_TEST_INPUT.TON_4.Pdate	
Controller.Micro850.Micro850.SELT_TEST_INPUT.TON_4.PT	
Controller.Micro850.Micro850.SELT_TEST_INPUT.TON_4.Q	
Controller.Micro850.Micro850.SELT_TEST_INPUT.TON_4.Redge	
Controller.Micro850.Micro850.SELT_TEST_INPUT.TON_5.ET	
Controller.Micro850.Micro850.SELT_TEST_INPUT.TON_5.IN	
Controller.Micro850.Micro850.SELT_TEST_INPUT.TON_5.Pdate	
Controller.Micro850.Micro850.SELT_TEST_INPUT.TON_5.PT	
Controller.Micro850.Micro850.SELT_TEST_INPUT.TON_5.Q	
Controller.Micro850.Micro850.SELT_TEST_INPUT.TON_5.Redge	
Controller.Micro850.Micro850.SELT_TEST_INPUT.TON_6.ET	
Controller.Micro850.Micro850.SELT_TEST_INPUT.TON_6.IN	
Controller.Micro850.Micro850.SELT_TEST_INPUT.TON_6.Pdate	
Controller.Micro850.Micro850.SELT_TEST_INPUT.TON_6.PT	
Controller.Micro850.Micro850.SELT_TEST_INPUT.TON_6.Q	
Controller.Micro850.Micro850.SELT_TEST_INPUT.TON_6.Redge	
Controller.Micro850.Micro850.SELT_TEST_INPUT.TON_7.ET	
Controller.Micro850.Micro850.SELT_TEST_INPUT.TON_7.IN	
Controller.Micro850.Micro850.SELT_TEST_INPUT.TON_7.Pdate	
Controller.Micro850.Micro850.SELT_TEST_INPUT.TON_7.PT	
Controller.Micro850.Micro850.SELT_TEST_INPUT.TON_7.Q	
Controller.Micro850.Micro850.SELT_TEST_INPUT.TON_7.Redge	
Controller.Micro850.Micro850.SELT_TEST_INPUT.TON_8.ET	
Controller.Micro850.Micro850.SELT_TEST_INPUT.TON_8.IN	
Controller.Micro850.Micro850.SELT_TEST_INPUT.TON_8.Pdate	
Controller.Micro850.Micro850.SELT_TEST_INPUT.TON_8.PT	
Controller.Micro850.Micro850.SELT_TEST_INPUT.TON_8.Q	
Controller.Micro850.Micro850.SELT_TEST_INPUT.TON_8.Redge	
Controller.Micro850.Micro850.SELT_TEST_INPUT.TON_9.ET	
Controller.Micro850.Micro850.SELT_TEST_INPUT.TON_9.IN	
Controller.Micro850.Micro850.SELT_TEST_INPUT.TON_9.Pdate	
Controller.Micro850.Micro850.SELT_TEST_INPUT.TON_9.PT	
Controller.Micro850.Micro850.SELT_TEST_INPUT.TON_9.Q	
Controller.Micro850.Micro850.SELT_TEST_INPUT.TON_9.Redge	
