EESchema Schematic File Version 2
LIBS:power
LIBS:device
LIBS:switches
LIBS:relays
LIBS:motors
LIBS:transistors
LIBS:conn
LIBS:linear
LIBS:regul
LIBS:74xx
LIBS:cmos4000
LIBS:adc-dac
LIBS:memory
LIBS:xilinx
LIBS:microcontrollers
LIBS:dsp
LIBS:microchip
LIBS:analog_switches
LIBS:motorola
LIBS:texas
LIBS:intel
LIBS:audio
LIBS:interface
LIBS:digital-audio
LIBS:philips
LIBS:display
LIBS:cypress
LIBS:siliconi
LIBS:opto
LIBS:atmel
LIBS:contrib
LIBS:valves
LIBS:shieldz80-cache
EELAYER 25 0
EELAYER END
$Descr A4 11693 8268
encoding utf-8
Sheet 2 2
Title ""
Date ""
Rev ""
Comp ""
Comment1 ""
Comment2 ""
Comment3 ""
Comment4 ""
$EndDescr
$Comp
L ATMEGA16A-PU U?
U 1 1 5A107D35
P 3400 3800
F 0 "U?" H 2550 5680 50  0000 L BNN
F 1 "ATMEGA16A-PU" H 3850 1850 50  0000 L BNN
F 2 "DIL40" H 3400 3800 50  0001 C CIN
F 3 "" H 3400 3800 50  0001 C CNN
	1    3400 3800
	1    0    0    -1  
$EndComp
$Comp
L VCC #PWR?
U 1 1 5A107DAC
P 3250 1400
F 0 "#PWR?" H 3250 1250 50  0001 C CNN
F 1 "VCC" H 3250 1550 50  0000 C CNN
F 2 "" H 3250 1400 50  0001 C CNN
F 3 "" H 3250 1400 50  0001 C CNN
	1    3250 1400
	1    0    0    -1  
$EndComp
$Comp
L C_Small C?
U 1 1 5A107E79
P 3000 1600
F 0 "C?" H 3010 1670 50  0000 L CNN
F 1 "10 uF" H 3010 1520 50  0000 L CNN
F 2 "10 uF" H 3000 1600 50  0001 C CNN
F 3 "" H 3000 1600 50  0001 C CNN
	1    3000 1600
	1    0    0    -1  
$EndComp
$Comp
L GND #PWR?
U 1 1 5A107EC2
P 3000 1700
F 0 "#PWR?" H 3000 1450 50  0001 C CNN
F 1 "GND" H 3000 1550 50  0000 C CNN
F 2 "" H 3000 1700 50  0001 C CNN
F 3 "" H 3000 1700 50  0001 C CNN
	1    3000 1700
	1    0    0    -1  
$EndComp
$Comp
L Conn_02x03_Counter_Clockwise J?
U 1 1 5A107F22
P 5900 3700
F 0 "J?" H 5950 3900 50  0000 C CNN
F 1 "ISCP" H 5950 3500 50  0000 C CNN
F 2 "" H 5900 3700 50  0001 C CNN
F 3 "" H 5900 3700 50  0001 C CNN
	1    5900 3700
	1    0    0    -1  
$EndComp
$Comp
L Conn_01x06 J?
U 1 1 5A107FCB
P 6000 4900
F 0 "J?" H 6000 5200 50  0000 C CNN
F 1 "FT232BL" H 6000 4500 50  0000 C CNN
F 2 "" H 6000 4900 50  0001 C CNN
F 3 "" H 6000 4900 50  0001 C CNN
	1    6000 4900
	1    0    0    -1  
$EndComp
$Comp
L Crystal Y?
U 1 1 5A1080D5
P 2200 2700
F 0 "Y?" H 2200 2850 50  0000 C CNN
F 1 "16 MHz" H 2200 2550 50  0000 C CNN
F 2 "" H 2200 2700 50  0001 C CNN
F 3 "" H 2200 2700 50  0001 C CNN
	1    2200 2700
	0    1    1    0   
$EndComp
$Comp
L C_Small C?
U 1 1 5A1081C8
P 1900 2500
F 0 "C?" H 1910 2570 50  0000 L CNN
F 1 "22 pF" H 1910 2420 50  0000 L CNN
F 2 "" H 1900 2500 50  0001 C CNN
F 3 "" H 1900 2500 50  0001 C CNN
	1    1900 2500
	0    1    1    0   
$EndComp
$Comp
L C_Small C?
U 1 1 5A10830E
P 1900 2900
F 0 "C?" H 1910 2970 50  0000 L CNN
F 1 "22 pF" H 1910 2820 50  0000 L CNN
F 2 "" H 1900 2900 50  0001 C CNN
F 3 "" H 1900 2900 50  0001 C CNN
	1    1900 2900
	0    1    1    0   
$EndComp
$Comp
L GND #PWR?
U 1 1 5A108465
P 1600 3000
F 0 "#PWR?" H 1600 2750 50  0001 C CNN
F 1 "GND" H 1600 2850 50  0000 C CNN
F 2 "" H 1600 3000 50  0001 C CNN
F 3 "" H 1600 3000 50  0001 C CNN
	1    1600 3000
	1    0    0    -1  
$EndComp
Text Notes 5650 4800 0    60   ~ 0
TX
Text Notes 5650 4900 0    60   ~ 0
RX
$Comp
L GND #PWR?
U 1 1 5A1087E6
P 3350 5950
F 0 "#PWR?" H 3350 5700 50  0001 C CNN
F 1 "GND" H 3350 5800 50  0000 C CNN
F 2 "" H 3350 5950 50  0001 C CNN
F 3 "" H 3350 5950 50  0001 C CNN
	1    3350 5950
	1    0    0    -1  
$EndComp
$Comp
L GND #PWR?
U 1 1 5A108806
P 5750 5250
F 0 "#PWR?" H 5750 5000 50  0001 C CNN
F 1 "GND" H 5750 5100 50  0000 C CNN
F 2 "" H 5750 5250 50  0001 C CNN
F 3 "" H 5750 5250 50  0001 C CNN
	1    5750 5250
	1    0    0    -1  
$EndComp
$Comp
L VCC #PWR?
U 1 1 5A108B04
P 6250 3550
F 0 "#PWR?" H 6250 3400 50  0001 C CNN
F 1 "VCC" H 6250 3700 50  0000 C CNN
F 2 "" H 6250 3550 50  0001 C CNN
F 3 "" H 6250 3550 50  0001 C CNN
	1    6250 3550
	1    0    0    -1  
$EndComp
$Comp
L GND #PWR?
U 1 1 5A108B44
P 6250 3850
F 0 "#PWR?" H 6250 3600 50  0001 C CNN
F 1 "GND" H 6250 3700 50  0000 C CNN
F 2 "" H 6250 3850 50  0001 C CNN
F 3 "" H 6250 3850 50  0001 C CNN
	1    6250 3850
	1    0    0    -1  
$EndComp
Text Label 5550 3800 0    60   ~ 0
RST
Text Label 2200 2100 0    60   ~ 0
RST
$Comp
L 74LS138 U?
U 1 1 5A109326
P 6150 2500
F 0 "U?" H 6250 3000 50  0000 C CNN
F 1 "74HC138" H 6300 1951 50  0000 C CNN
F 2 "" H 6150 2500 50  0001 C CNN
F 3 "" H 6150 2500 50  0001 C CNN
	1    6150 2500
	1    0    0    -1  
$EndComp
$Comp
L VCC #PWR?
U 1 1 5A1095CB
P 5500 2600
F 0 "#PWR?" H 5500 2450 50  0001 C CNN
F 1 "VCC" H 5500 2750 50  0000 C CNN
F 2 "" H 5500 2600 50  0001 C CNN
F 3 "" H 5500 2600 50  0001 C CNN
	1    5500 2600
	1    0    0    -1  
$EndComp
$Comp
L GND #PWR?
U 1 1 5A1095EF
P 5500 2900
F 0 "#PWR?" H 5500 2650 50  0001 C CNN
F 1 "GND" H 5500 2750 50  0000 C CNN
F 2 "" H 5500 2900 50  0001 C CNN
F 3 "" H 5500 2900 50  0001 C CNN
	1    5500 2900
	1    0    0    -1  
$EndComp
Wire Wire Line
	3250 1400 3250 1800
Wire Wire Line
	3000 1500 3250 1500
Connection ~ 3250 1500
Wire Wire Line
	2000 2500 2400 2500
Wire Wire Line
	2200 2550 2200 2500
Connection ~ 2200 2500
Wire Wire Line
	2000 2900 2400 2900
Wire Wire Line
	2200 2850 2200 2900
Connection ~ 2200 2900
Wire Wire Line
	1800 2500 1600 2500
Wire Wire Line
	1600 2500 1600 3000
Wire Wire Line
	1800 2900 1600 2900
Connection ~ 1600 2900
Wire Wire Line
	4400 4800 5800 4800
Wire Wire Line
	4400 4900 5800 4900
Wire Wire Line
	5750 5250 5750 5200
Wire Wire Line
	5750 5200 5800 5200
Wire Wire Line
	4400 3600 5700 3600
Wire Wire Line
	4400 3700 5700 3700
Wire Wire Line
	6200 3800 6250 3800
Wire Wire Line
	6250 3800 6250 3850
Wire Wire Line
	6200 3600 6250 3600
Wire Wire Line
	6250 3600 6250 3550
Wire Wire Line
	4400 3500 5800 3500
Wire Wire Line
	6450 3700 6200 3700
Wire Wire Line
	5700 3800 5500 3800
Wire Wire Line
	2400 2100 2200 2100
Wire Wire Line
	5800 3500 5800 3350
Wire Wire Line
	5800 3350 6450 3350
Wire Wire Line
	6450 3350 6450 3700
Wire Wire Line
	3350 5800 3350 5950
Wire Wire Line
	5550 2650 5500 2650
Wire Wire Line
	5500 2650 5500 2600
Wire Wire Line
	5550 2850 5500 2850
Wire Wire Line
	5500 2750 5500 2900
Wire Wire Line
	5550 2750 5500 2750
Connection ~ 5500 2850
Wire Wire Line
	5550 2350 5350 2350
Wire Wire Line
	4400 3200 5350 3200
Wire Wire Line
	5350 3200 5350 2350
Wire Wire Line
	4400 3100 5300 3100
Wire Wire Line
	5300 3100 5300 2250
Wire Wire Line
	5300 2250 5550 2250
Wire Wire Line
	4400 3000 5250 3000
Wire Wire Line
	5250 3000 5250 2150
Wire Wire Line
	5250 2150 5550 2150
$Comp
L 74HC595 U?
U 1 1 5A109AAF
P 8050 3850
F 0 "U?" H 8200 4450 50  0000 C CNN
F 1 "74HC595" H 8050 3250 50  0000 C CNN
F 2 "" H 8050 3850 50  0001 C CNN
F 3 "" H 8050 3850 50  0001 C CNN
	1    8050 3850
	1    0    0    -1  
$EndComp
Wire Wire Line
	5350 3700 5350 4100
Wire Wire Line
	5350 4100 7150 4100
Wire Wire Line
	7150 4100 7150 3600
Connection ~ 5350 3700
Wire Wire Line
	7150 3600 7350 3600
Wire Wire Line
	7350 3400 6450 3400
Connection ~ 6450 3400
Wire Wire Line
	6750 2750 6850 2750
Wire Wire Line
	6850 2750 6850 4000
Wire Wire Line
	6850 4000 7350 4000
NoConn ~ 8750 4300
NoConn ~ 5800 4700
NoConn ~ 5800 5000
NoConn ~ 5800 5100
NoConn ~ 3450 5800
NoConn ~ 2400 3300
NoConn ~ 3550 1800
Wire Wire Line
	4400 3300 7050 3300
Wire Wire Line
	7050 3300 7050 3900
Wire Wire Line
	7050 3900 7350 3900
$Comp
L VCC #PWR?
U 1 1 5A11E466
P 7250 3700
F 0 "#PWR?" H 7250 3550 50  0001 C CNN
F 1 "VCC" H 7250 3850 50  0000 C CNN
F 2 "" H 7250 3700 50  0001 C CNN
F 3 "" H 7250 3700 50  0001 C CNN
	1    7250 3700
	1    0    0    -1  
$EndComp
Wire Wire Line
	7250 3700 7350 3700
$EndSCHEMATC
