EESchema Schematic File Version 2
LIBS:power
LIBS:device
LIBS:transistors
LIBS:conn
LIBS:linear
LIBS:regul
LIBS:74xx
LIBS:cmos4000
LIBS:adc-dac
LIBS:memory
LIBS:xilinx
LIBS:microcontrollers
LIBS:dsp
LIBS:microchip
LIBS:analog_switches
LIBS:motorola
LIBS:texas
LIBS:intel
LIBS:audio
LIBS:interface
LIBS:digital-audio
LIBS:philips
LIBS:display
LIBS:cypress
LIBS:siliconi
LIBS:opto
LIBS:atmel
LIBS:contrib
LIBS:valves
LIBS:rom-burner-cache
EELAYER 27 0
EELAYER END
$Descr A4 11693 8268
encoding utf-8
Sheet 1 1
Title ""
Date "5 dec 2016"
Rev ""
Comp ""
Comment1 ""
Comment2 ""
Comment3 ""
Comment4 ""
$EndDescr
$Comp
L ATMEGA16-A IC1
U 1 1 583ADEC2
P 3100 4050
F 0 "IC1" H 2150 5930 50  0000 L BNN
F 1 "ATMEGA16-A" H 3600 2100 50  0000 L BNN
F 2 "TQFP44" H 3100 4050 50  0000 C CIN
F 3 "" H 3100 4050 50  0000 C CNN
	1    3100 4050
	1    0    0    -1  
$EndComp
$Comp
L CONN_01X06 P1
U 1 1 583ADFCD
P 5550 5650
F 0 "P1" H 5550 6000 50  0000 C CNN
F 1 "CONN_01X06" V 5650 5650 50  0000 C CNN
F 2 "" H 5550 5650 50  0000 C CNN
F 3 "" H 5550 5650 50  0000 C CNN
	1    5550 5650
	1    0    0    -1  
$EndComp
$Comp
L CONN_02X20 P2
U 1 1 583AE158
P 5800 3300
F 0 "P2" H 5800 4350 50  0000 C CNN
F 1 "CHIP CONNECTOR" V 5800 3300 50  0000 C CNN
F 2 "" H 5800 2350 50  0000 C CNN
F 3 "" H 5800 2350 50  0000 C CNN
	1    5800 3300
	1    0    0    -1  
$EndComp
$Comp
L Crystal_Small Y1
U 1 1 583AE1D1
P 1850 2950
F 0 "Y1" H 1850 3050 50  0000 C CNN
F 1 "~" H 1850 2850 50  0000 C CNN
F 2 "16 Mhz" H 1850 2850 50  0000 C CNN
F 3 "" H 1850 2950 50  0000 C CNN
	1    1850 2950
	0    1    1    0   
$EndComp
$Comp
L C_Small C1
U 1 1 583AE224
P 1550 2750
F 0 "C1" H 1560 2820 50  0000 L CNN
F 1 "~" H 1560 2670 50  0000 L CNN
F 2 "22 pF" H 1400 2650 50  0000 C CNN
F 3 "" H 1550 2750 50  0000 C CNN
	1    1550 2750
	0    1    1    0   
$EndComp
$Comp
L C_Small C2
U 1 1 583AE3FA
P 1550 3150
F 0 "C2" H 1560 3220 50  0000 L CNN
F 1 "~" H 1560 3070 50  0000 L CNN
F 2 "22 pF" H 1400 3050 50  0000 C CNN
F 3 "" H 1550 3150 50  0000 C CNN
	1    1550 3150
	0    1    1    0   
$EndComp
$Comp
L GND #PWR01
U 1 1 583AE486
P 1350 3250
F 0 "#PWR01" H 1350 3000 50  0001 C CNN
F 1 "GND" H 1350 3100 50  0000 C CNN
F 2 "" H 1350 3250 50  0000 C CNN
F 3 "" H 1350 3250 50  0000 C CNN
	1    1350 3250
	1    0    0    -1  
$EndComp
NoConn ~ 2000 3550
$Comp
L VCC #PWR02
U 1 1 583AE935
P 2800 1500
F 0 "#PWR02" H 2800 1350 50  0001 C CNN
F 1 "VCC" H 2800 1650 50  0000 C CNN
F 2 "" H 2800 1500 50  0000 C CNN
F 3 "" H 2800 1500 50  0000 C CNN
	1    2800 1500
	1    0    0    -1  
$EndComp
NoConn ~ 3200 2050
$Comp
L GND #PWR03
U 1 1 583AEB05
P 2800 6150
F 0 "#PWR03" H 2800 5900 50  0001 C CNN
F 1 "GND" H 2800 6000 50  0000 C CNN
F 2 "" H 2800 6150 50  0000 C CNN
F 3 "" H 2800 6150 50  0000 C CNN
	1    2800 6150
	1    0    0    -1  
$EndComp
NoConn ~ 3200 6050
Entry Wire Line
	4200 2350 4300 2450
Entry Wire Line
	4200 2450 4300 2550
Entry Wire Line
	4200 2550 4300 2650
Entry Wire Line
	4200 2650 4300 2750
Entry Wire Line
	4200 2750 4300 2850
Entry Wire Line
	4200 2850 4300 2950
Entry Wire Line
	4200 2950 4300 3050
Entry Wire Line
	4200 3050 4300 3150
Entry Wire Line
	4250 3250 4350 3350
Entry Wire Line
	4250 3350 4350 3450
Entry Wire Line
	4250 3450 4350 3550
Entry Wire Line
	4250 3550 4350 3650
Entry Wire Line
	4250 3650 4350 3750
Entry Wire Line
	4250 3750 4350 3850
Entry Wire Line
	4250 3850 4350 3950
Entry Wire Line
	4250 3950 4350 4050
Entry Wire Line
	4300 4250 4400 4350
Entry Wire Line
	4300 4350 4400 4450
Entry Wire Line
	4300 4450 4400 4550
Entry Wire Line
	4300 4550 4400 4650
Entry Wire Line
	4300 4650 4400 4750
Entry Wire Line
	4300 4750 4400 4850
Entry Wire Line
	4350 5250 4450 5350
Entry Wire Line
	4350 5350 4450 5450
Entry Wire Line
	4350 5450 4450 5550
Entry Wire Line
	4350 5550 4450 5650
Entry Wire Line
	4350 5650 4450 5750
Entry Wire Line
	4350 5750 4450 5850
Entry Wire Line
	5450 2250 5550 2350
Entry Wire Line
	5450 2350 5550 2450
Entry Wire Line
	5450 2450 5550 2550
Entry Wire Line
	5450 2550 5550 2650
Entry Wire Line
	5450 2650 5550 2750
Entry Wire Line
	5450 2750 5550 2850
Entry Wire Line
	5450 2850 5550 2950
Entry Wire Line
	5450 2950 5550 3050
Entry Wire Line
	5450 3050 5550 3150
Entry Wire Line
	5450 3150 5550 3250
Entry Wire Line
	5450 3250 5550 3350
Entry Wire Line
	5450 3350 5550 3450
Entry Wire Line
	5450 3450 5550 3550
Entry Wire Line
	5450 3550 5550 3650
Entry Wire Line
	5450 3650 5550 3750
Entry Wire Line
	6150 2250 6050 2350
Entry Wire Line
	6150 2350 6050 2450
Entry Wire Line
	6150 2450 6050 2550
Entry Wire Line
	6150 2550 6050 2650
Entry Wire Line
	6150 2650 6050 2750
Entry Wire Line
	6150 2750 6050 2850
Entry Wire Line
	6150 2850 6050 2950
Entry Wire Line
	6150 2950 6050 3050
Entry Wire Line
	6200 3050 6100 3150
Entry Wire Line
	6200 3150 6100 3250
Entry Wire Line
	6200 3250 6100 3350
Entry Wire Line
	6200 3350 6100 3450
Entry Wire Line
	6200 3450 6100 3550
Entry Wire Line
	6200 3550 6100 3650
Text Notes 6350 4200 1    60   ~ 0
ADD EXTERNAL CONNECTOR TO BOTH SIDES
Text Notes 5150 5400 0    60   ~ 0
DTR
Text Notes 5150 5500 0    60   ~ 0
RX
Text Notes 5150 5600 0    60   ~ 0
TX
Text Notes 5150 5700 0    60   ~ 0
VCC
Text Notes 5150 5800 0    60   ~ 0
CTS
Text Notes 5150 5900 0    60   ~ 0
GND
$Comp
L VCC #PWR04
U 1 1 583B2E5F
P 6000 4750
F 0 "#PWR04" H 6000 4600 50  0001 C CNN
F 1 "VCC" H 6000 4900 50  0000 C CNN
F 2 "" H 6000 4750 50  0000 C CNN
F 3 "" H 6000 4750 50  0000 C CNN
	1    6000 4750
	1    0    0    -1  
$EndComp
$Comp
L GND #PWR05
U 1 1 583B2ECB
P 5000 6050
F 0 "#PWR05" H 5000 5800 50  0001 C CNN
F 1 "GND" H 5000 5900 50  0000 C CNN
F 2 "" H 5000 6050 50  0000 C CNN
F 3 "" H 5000 6050 50  0000 C CNN
	1    5000 6050
	1    0    0    -1  
$EndComp
NoConn ~ 5350 5400
NoConn ~ 5350 5800
Wire Wire Line
	1850 2850 1850 2750
Wire Wire Line
	1650 2750 2000 2750
Wire Wire Line
	1850 3050 1850 3150
Wire Wire Line
	1650 3150 2000 3150
Connection ~ 1850 2750
Connection ~ 1850 3150
Wire Wire Line
	1450 2750 1350 2750
Wire Wire Line
	1350 2750 1350 3250
Wire Wire Line
	1350 3150 1450 3150
Connection ~ 1350 3150
Wire Wire Line
	2800 6150 2800 6050
Wire Wire Line
	4200 3250 4250 3250
Wire Wire Line
	4250 3350 4200 3350
Wire Wire Line
	4200 3450 4250 3450
Wire Wire Line
	4250 3550 4200 3550
Wire Wire Line
	4250 3650 4200 3650
Wire Wire Line
	4200 3750 4250 3750
Wire Wire Line
	4250 3850 4200 3850
Wire Wire Line
	4200 3950 4250 3950
Wire Wire Line
	4350 5250 4200 5250
Wire Wire Line
	4350 5350 4200 5350
Wire Wire Line
	4350 5450 4200 5450
Wire Wire Line
	4200 5550 4350 5550
Wire Wire Line
	4350 5650 4200 5650
Wire Wire Line
	4350 5750 4200 5750
Wire Wire Line
	4200 4150 5100 4150
Wire Wire Line
	4200 4250 4300 4250
Wire Wire Line
	4300 4350 4200 4350
Wire Wire Line
	4200 4450 4300 4450
Wire Wire Line
	4300 4550 4200 4550
Wire Wire Line
	4200 4650 4300 4650
Wire Wire Line
	4300 4750 4200 4750
Wire Wire Line
	4200 4850 4300 4850
Wire Bus Line
	4300 2250 4300 3150
Wire Bus Line
	4400 3150 4400 4950
Wire Bus Line
	5450 3150 5450 3650
Wire Bus Line
	4350 2150 4350 4050
Wire Bus Line
	4350 2150 6150 2150
Wire Bus Line
	6150 2150 6150 2950
Wire Wire Line
	6100 3150 6050 3150
Wire Wire Line
	6050 3250 6100 3250
Wire Wire Line
	6050 3350 6100 3350
Wire Wire Line
	6050 3450 6100 3450
Wire Wire Line
	6050 3550 6100 3550
Wire Wire Line
	6050 3650 6100 3650
Wire Bus Line
	5450 2250 5450 3050
Wire Bus Line
	5450 2250 4300 2250
Wire Bus Line
	6200 2050 6200 3550
Wire Wire Line
	4200 5150 4650 5150
Wire Wire Line
	4650 5150 4650 5500
Wire Wire Line
	4650 5500 5350 5500
Wire Wire Line
	4200 5050 4750 5050
Wire Wire Line
	4750 5050 4750 5600
Wire Wire Line
	4750 5600 5350 5600
Wire Wire Line
	5000 5700 5350 5700
Wire Wire Line
	5000 5000 5000 5700
Wire Wire Line
	5000 6050 5000 5900
Wire Wire Line
	5000 5900 5350 5900
Wire Bus Line
	4450 2050 4450 5850
Wire Bus Line
	4450 2050 6200 2050
Wire Bus Line
	4400 3150 5450 3150
Entry Wire Line
	4300 4850 4400 4950
Text Label 4750 3150 0    60   ~ 0
PORTC
Text Label 4750 2250 0    60   ~ 0
PORTA
Text Label 4750 2150 0    60   ~ 0
PORTB
Text Label 4750 2050 0    60   ~ 0
PORTD
Wire Wire Line
	5100 4150 5100 4500
Wire Wire Line
	5100 4500 6200 4500
Wire Wire Line
	6200 4500 6200 3750
Wire Wire Line
	6200 3750 6050 3750
$Comp
L SPST SW?
U 1 1 5845D742
P 5500 5000
F 0 "SW?" H 5500 5100 70  0000 C CNN
F 1 "SPST" H 5500 4900 70  0000 C CNN
F 2 "~" H 5500 5000 60  0000 C CNN
F 3 "~" H 5500 5000 60  0000 C CNN
	1    5500 5000
	1    0    0    -1  
$EndComp
Wire Wire Line
	6000 4750 6000 5000
Text Notes 4550 3900 0    60   ~ 0
ADD PROGRAMMER\nCONNECTION
$Comp
L C C?
U 1 1 5845D909
P 6350 6200
F 0 "C?" H 6350 6300 40  0000 L CNN
F 1 "C" H 6356 6115 40  0000 L CNN
F 2 "10uF" H 6450 6050 30  0000 C CNN
F 3 "~" H 6350 6200 60  0000 C CNN
	1    6350 6200
	1    0    0    -1  
$EndComp
$Comp
L VCC #PWR?
U 1 1 5845D916
P 6350 5850
F 0 "#PWR?" H 6350 5700 50  0001 C CNN
F 1 "VCC" H 6350 6000 50  0000 C CNN
F 2 "" H 6350 5850 50  0000 C CNN
F 3 "" H 6350 5850 50  0000 C CNN
	1    6350 5850
	1    0    0    -1  
$EndComp
$Comp
L GND #PWR?
U 1 1 5845D91C
P 6350 6600
F 0 "#PWR?" H 6350 6350 50  0001 C CNN
F 1 "GND" H 6350 6450 50  0000 C CNN
F 2 "" H 6350 6600 50  0000 C CNN
F 3 "" H 6350 6600 50  0000 C CNN
	1    6350 6600
	1    0    0    -1  
$EndComp
Wire Wire Line
	6350 6400 6350 6600
Wire Wire Line
	6350 5850 6350 6000
Wire Wire Line
	6350 6000 6850 6000
Wire Wire Line
	6350 6400 6850 6400
Text GLabel 6850 6000 2    60   Input ~ 0
TO_VCC
Text GLabel 6850 6400 2    60   Input ~ 0
TO_GND
$Comp
L C_SMALL C?
U 1 1 5845DA7E
P 2550 1850
F 0 "C?" H 2560 1920 50  0000 L CNN
F 1 "C_SMALL" H 2560 1770 50  0000 L CNN
F 2 "10uF" H 2400 1900 50  0000 C CNN
F 3 "~" H 2550 1850 50  0000 C CNN
	1    2550 1850
	1    0    0    -1  
$EndComp
$Comp
L GND #PWR?
U 1 1 5845DA8B
P 2550 2000
F 0 "#PWR?" H 2550 1750 50  0001 C CNN
F 1 "GND" H 2550 1850 50  0000 C CNN
F 2 "" H 2550 2000 50  0000 C CNN
F 3 "" H 2550 2000 50  0000 C CNN
	1    2550 2000
	1    0    0    -1  
$EndComp
$Comp
L R R?
U 1 1 5845DB1D
P 2000 2100
F 0 "R?" V 2080 2100 40  0000 C CNN
F 1 "R" V 2007 2101 40  0000 C CNN
F 2 "5K" V 1930 2100 30  0000 C CNN
F 3 "~" H 2000 2100 30  0000 C CNN
	1    2000 2100
	1    0    0    -1  
$EndComp
$Comp
L VCC #PWR?
U 1 1 5845DB2A
P 2000 1850
F 0 "#PWR?" H 2000 1700 50  0001 C CNN
F 1 "VCC" H 2000 2000 50  0000 C CNN
F 2 "" H 2000 1850 50  0000 C CNN
F 3 "" H 2000 1850 50  0000 C CNN
	1    2000 1850
	1    0    0    -1  
$EndComp
Connection ~ 5000 5200
$Comp
L LED D?
U 1 1 5845DBD6
P 6700 5000
F 0 "D?" H 6700 5100 50  0000 C CNN
F 1 "LED" H 6700 4900 50  0000 C CNN
F 2 "~" H 6700 5000 60  0000 C CNN
F 3 "~" H 6700 5000 60  0000 C CNN
	1    6700 5000
	1    0    0    -1  
$EndComp
$Comp
L R R?
U 1 1 5845DBEF
P 6250 5000
F 0 "R?" V 6330 5000 40  0000 C CNN
F 1 "R" V 6257 5001 40  0000 C CNN
F 2 "180" V 6180 5000 30  0000 C CNN
F 3 "~" H 6250 5000 30  0000 C CNN
	1    6250 5000
	0    -1   -1   0   
$EndComp
$Comp
L GND #PWR?
U 1 1 5845DC65
P 7050 5150
F 0 "#PWR?" H 7050 4900 50  0001 C CNN
F 1 "GND" H 7050 5000 50  0000 C CNN
F 2 "" H 7050 5150 50  0000 C CNN
F 3 "" H 7050 5150 50  0000 C CNN
	1    7050 5150
	1    0    0    -1  
$EndComp
Wire Wire Line
	7050 5150 7050 5000
Wire Wire Line
	7050 5000 6900 5000
Wire Wire Line
	2550 1950 2550 2000
Wire Wire Line
	2800 1500 2800 2050
Wire Wire Line
	3000 1750 3000 2050
$Comp
L C_SMALL C?
U 1 1 5845DE47
P 3350 1850
F 0 "C?" H 3360 1920 50  0000 L CNN
F 1 "C_SMALL" H 3360 1770 50  0000 L CNN
F 2 "10uF" H 3200 1900 50  0000 C CNN
F 3 "~" H 3350 1850 50  0000 C CNN
	1    3350 1850
	1    0    0    -1  
$EndComp
$Comp
L GND #PWR?
U 1 1 5845DE4D
P 3350 2000
F 0 "#PWR?" H 3350 1750 50  0001 C CNN
F 1 "GND" H 3350 1850 50  0000 C CNN
F 2 "" H 3350 2000 50  0000 C CNN
F 3 "" H 3350 2000 50  0000 C CNN
	1    3350 2000
	1    0    0    -1  
$EndComp
Wire Wire Line
	3350 1950 3350 2000
Wire Wire Line
	2550 1750 2800 1750
Wire Wire Line
	3000 1750 3350 1750
$Comp
L C_SMALL C?
U 1 1 5845DF4B
P 3750 1850
F 0 "C?" H 3760 1920 50  0000 L CNN
F 1 "C_SMALL" H 3760 1770 50  0000 L CNN
F 2 "10uF" H 3600 1900 50  0000 C CNN
F 3 "~" H 3750 1850 50  0000 C CNN
	1    3750 1850
	1    0    0    -1  
$EndComp
$Comp
L GND #PWR?
U 1 1 5845DF51
P 3750 2000
F 0 "#PWR?" H 3750 1750 50  0001 C CNN
F 1 "GND" H 3750 1850 50  0000 C CNN
F 2 "" H 3750 2000 50  0000 C CNN
F 3 "" H 3750 2000 50  0000 C CNN
	1    3750 2000
	1    0    0    -1  
$EndComp
Wire Wire Line
	3750 2000 3750 1950
Wire Wire Line
	2900 2050 2900 1650
Wire Wire Line
	2900 1650 3750 1650
Wire Wire Line
	3750 1650 3750 1750
Connection ~ 2800 1750
$Comp
L VCC #PWR?
U 1 1 5845E05D
P 2950 1500
F 0 "#PWR?" H 2950 1350 50  0001 C CNN
F 1 "VCC" H 2950 1650 50  0000 C CNN
F 2 "" H 2950 1500 50  0000 C CNN
F 3 "" H 2950 1500 50  0000 C CNN
	1    2950 1500
	1    0    0    -1  
$EndComp
$Comp
L VCC #PWR?
U 1 1 5845E063
P 3100 1500
F 0 "#PWR?" H 3100 1350 50  0001 C CNN
F 1 "VCC" H 3100 1650 50  0000 C CNN
F 2 "" H 3100 1500 50  0000 C CNN
F 3 "" H 3100 1500 50  0000 C CNN
	1    3100 1500
	1    0    0    -1  
$EndComp
Wire Wire Line
	2950 1500 2950 1650
Connection ~ 2950 1650
Wire Wire Line
	3100 1500 3100 1750
Connection ~ 3100 1750
$Comp
L GND #PWR?
U 1 1 5845E115
P 2900 6150
F 0 "#PWR?" H 2900 5900 50  0001 C CNN
F 1 "GND" H 2900 6000 50  0000 C CNN
F 2 "" H 2900 6150 50  0000 C CNN
F 3 "" H 2900 6150 50  0000 C CNN
	1    2900 6150
	1    0    0    -1  
$EndComp
$Comp
L GND #PWR?
U 1 1 5845E11B
P 3000 6150
F 0 "#PWR?" H 3000 5900 50  0001 C CNN
F 1 "GND" H 3000 6000 50  0000 C CNN
F 2 "" H 3000 6150 50  0000 C CNN
F 3 "" H 3000 6150 50  0000 C CNN
	1    3000 6150
	1    0    0    -1  
$EndComp
Wire Wire Line
	2900 6050 2900 6150
Wire Wire Line
	3000 6050 3000 6150
$EndSCHEMATC
