EESchema Schematic File Version 2
LIBS:power
LIBS:device
LIBS:transistors
LIBS:conn
LIBS:linear
LIBS:regul
LIBS:74xx
LIBS:cmos4000
LIBS:adc-dac
LIBS:memory
LIBS:xilinx
LIBS:microcontrollers
LIBS:dsp
LIBS:microchip
LIBS:analog_switches
LIBS:motorola
LIBS:texas
LIBS:intel
LIBS:audio
LIBS:interface
LIBS:digital-audio
LIBS:philips
LIBS:display
LIBS:cypress
LIBS:siliconi
LIBS:opto
LIBS:atmel
LIBS:contrib
LIBS:valves
LIBS:cpu
LIBS:cpu-cache
EELAYER 25 0
EELAYER END
$Descr A4 11693 8268
encoding utf-8
Sheet 1 1
Title ""
Date ""
Rev ""
Comp ""
Comment1 ""
Comment2 ""
Comment3 ""
Comment4 ""
$EndDescr
$Comp
L Z80 U1
U 1 1 5863073D
P 2050 2350
F 0 "U1" H 2050 2350 60  0000 C CNN
F 1 "Z80" H 2350 900 60  0000 C CNN
F 2 "Housings_DIP:DIP-40_W15.24mm_LongPads" H 2050 2350 60  0001 C CNN
F 3 "" H 2050 2350 60  0001 C CNN
	1    2050 2350
	1    0    0    -1  
$EndComp
$Comp
L VCC #PWR01
U 1 1 58630826
P 2050 1000
F 0 "#PWR01" H 2050 850 50  0001 C CNN
F 1 "VCC" H 2050 1150 50  0000 C CNN
F 2 "" H 2050 1000 50  0000 C CNN
F 3 "" H 2050 1000 50  0000 C CNN
	1    2050 1000
	1    0    0    -1  
$EndComp
$Comp
L GND #PWR02
U 1 1 5863083C
P 2050 3800
F 0 "#PWR02" H 2050 3550 50  0001 C CNN
F 1 "GND" H 2050 3650 50  0000 C CNN
F 2 "" H 2050 3800 50  0000 C CNN
F 3 "" H 2050 3800 50  0000 C CNN
	1    2050 3800
	1    0    0    -1  
$EndComp
$Comp
L VCC #PWR03
U 1 1 58630865
P 600 1000
F 0 "#PWR03" H 600 850 50  0001 C CNN
F 1 "VCC" H 600 1150 50  0000 C CNN
F 2 "" H 600 1000 50  0000 C CNN
F 3 "" H 600 1000 50  0000 C CNN
	1    600  1000
	1    0    0    -1  
$EndComp
$Comp
L VCC #PWR04
U 1 1 586309B3
P 3700 5900
F 0 "#PWR04" H 3700 5750 50  0001 C CNN
F 1 "VCC" H 3700 6050 50  0000 C CNN
F 2 "" H 3700 5900 50  0000 C CNN
F 3 "" H 3700 5900 50  0000 C CNN
	1    3700 5900
	1    0    0    -1  
$EndComp
$Comp
L GND #PWR05
U 1 1 586309D7
P 6300 6400
F 0 "#PWR05" H 6300 6150 50  0001 C CNN
F 1 "GND" H 6300 6250 50  0000 C CNN
F 2 "" H 6300 6400 50  0000 C CNN
F 3 "" H 6300 6400 50  0000 C CNN
	1    6300 6400
	1    0    0    -1  
$EndComp
$Comp
L HM62256BLP-7 U3
U 1 1 58630C5F
P 4100 1950
F 0 "U3" H 3800 2850 50  0000 C CNN
F 1 "HM62256BLP-7" H 4500 1150 50  0000 C CNN
F 2 "Housings_DIP:DIP-28_W15.24mm_LongPads" H 4150 1050 50  0001 C CIN
F 3 "" H 4100 1950 50  0000 C CNN
	1    4100 1950
	1    0    0    -1  
$EndComp
Text GLabel 5000 6000 1    60   Input ~ 0
~RESET
Text GLabel 1050 2950 0    60   Input ~ 0
~RESET
$Comp
L D_Small D1
U 1 1 58631170
P 1200 2950
F 0 "D1" H 1150 3030 50  0000 L CNN
F 1 "1N4148" H 1050 2870 50  0000 L CNN
F 2 "Diodes_ThroughHole:Diode_DO-35_SOD27_Horizontal_RM10" V 1200 2950 50  0001 C CNN
F 3 "" V 1200 2950 50  0000 C CNN
	1    1200 2950
	-1   0    0    1   
$EndComp
Text GLabel 1200 1250 0    60   Input ~ 0
~M1
Text GLabel 1200 1350 0    60   Input ~ 0
~MREQ
Text GLabel 1200 1450 0    60   Input ~ 0
~IORQ
Text GLabel 1200 1550 0    60   Input ~ 0
~RD
Text GLabel 1200 1650 0    60   Input ~ 0
~WR
NoConn ~ 1400 1900
Text GLabel 1200 2150 0    60   Input ~ 0
~HALT
NoConn ~ 1400 3300
Text GLabel 5500 6000 1    60   Input ~ 0
~WR
Text GLabel 5600 6000 1    60   Input ~ 0
~RD
Text GLabel 5400 6000 1    60   Input ~ 0
~IORQ
$Comp
L 74LS139 U4
U 1 1 58642124
P 4400 3750
F 0 "U4" H 4400 3850 50  0000 C CNN
F 1 "74HC139" H 4400 3650 50  0000 C CNN
F 2 "Housings_DIP:DIP-16_W7.62mm_LongPads" H 4400 3750 50  0001 C CNN
F 3 "" H 4400 3750 50  0000 C CNN
	1    4400 3750
	1    0    0    -1  
$EndComp
$Comp
L ATTINY2313-P IC1
U 1 1 5864288B
P 8550 2050
F 0 "IC1" H 7600 3050 50  0000 C CNN
F 1 "ATTINY2313-P" H 9350 1150 50  0000 C CNN
F 2 "Housings_DIP:DIP-20_W7.62mm" H 8550 2050 50  0001 C CIN
F 3 "" H 8550 2050 50  0000 C CNN
	1    8550 2050
	1    0    0    -1  
$EndComp
$Comp
L 4040 U6
U 1 1 58642A1E
P 6300 4700
F 0 "U6" H 6400 5350 50  0000 C CNN
F 1 "4040" H 6550 4050 50  0000 C CNN
F 2 "Housings_DIP:DIP-16_W7.62mm_LongPads" H 6300 4700 60  0001 C CNN
F 3 "" H 6300 4700 60  0001 C CNN
	1    6300 4700
	1    0    0    -1  
$EndComp
$Comp
L 74LS157 U2
U 1 1 58643101
P 2450 5250
F 0 "U2" H 2500 5400 50  0000 C CNN
F 1 "74HC157" H 2500 5100 50  0000 C CNN
F 2 "Housings_DIP:DIP-16_W7.62mm_LongPads" H 2450 5250 50  0001 C CNN
F 3 "" H 2450 5250 50  0000 C CNN
	1    2450 5250
	1    0    0    -1  
$EndComp
$Comp
L CONN_02X03 P3
U 1 1 58643A89
P 10700 2950
F 0 "P3" H 10700 3150 50  0000 C CNN
F 1 "CONN_02X03" H 10700 2750 50  0000 C CNN
F 2 "Pin_Headers:Pin_Header_Straight_2x03" H 10700 1750 50  0001 C CNN
F 3 "" H 10700 1750 50  0000 C CNN
	1    10700 2950
	1    0    0    -1  
$EndComp
Text Label 2700 1200 0    60   ~ 0
A0
Text Label 2700 1300 0    60   ~ 0
A1
Text Label 2700 1400 0    60   ~ 0
A2
Text Label 2700 1500 0    60   ~ 0
A3
Text Label 2700 1600 0    60   ~ 0
A4
Text Label 2700 1700 0    60   ~ 0
A5
Text Label 2700 1800 0    60   ~ 0
A6
Text Label 2700 1900 0    60   ~ 0
A7
Text Label 2700 2000 0    60   ~ 0
A8
Text Label 2700 2100 0    60   ~ 0
A9
Text Label 2700 2200 0    60   ~ 0
A10
Text Label 2700 2300 0    60   ~ 0
A11
Text Label 2700 2400 0    60   ~ 0
A12
Text Label 2700 2500 0    60   ~ 0
A13
Text Label 2700 2600 0    60   ~ 0
A14
Text Label 2700 2700 0    60   ~ 0
A15
Text Label 3350 1200 0    60   ~ 0
A0
Text Label 3350 1300 0    60   ~ 0
A1
Text Label 3350 1400 0    60   ~ 0
A2
Text Label 3350 1500 0    60   ~ 0
A3
Text Label 3350 1600 0    60   ~ 0
A4
Text Label 3350 1700 0    60   ~ 0
A5
Text Label 3350 1800 0    60   ~ 0
A6
Text Label 3350 1900 0    60   ~ 0
A7
Text Label 3350 2000 0    60   ~ 0
A8
Text Label 3350 2100 0    60   ~ 0
A9
Text Label 3350 2200 0    60   ~ 0
A10
Text Label 3350 2300 0    60   ~ 0
A11
Text Label 3350 2400 0    60   ~ 0
A12
Text Label 3350 2500 0    60   ~ 0
A13
Text Label 3350 2600 0    60   ~ 0
A14
Text Label 4650 1200 0    60   ~ 0
D0
Text Label 4650 1300 0    60   ~ 0
D1
Text Label 4650 1400 0    60   ~ 0
D2
Text Label 4650 1500 0    60   ~ 0
D3
Text Label 4650 1600 0    60   ~ 0
D4
Text Label 4650 1700 0    60   ~ 0
D5
Text Label 4650 1800 0    60   ~ 0
D6
Text Label 4650 1900 0    60   ~ 0
D7
Entry Wire Line
	2900 1200 3000 1100
Entry Wire Line
	2900 1300 3000 1200
Entry Wire Line
	2900 1300 3000 1200
Entry Wire Line
	2900 1400 3000 1300
Entry Wire Line
	2900 1500 3000 1400
Entry Wire Line
	2900 1600 3000 1500
Entry Wire Line
	2900 1700 3000 1600
Entry Wire Line
	2900 1800 3000 1700
Entry Wire Line
	2900 1900 3000 1800
Entry Wire Line
	2900 2000 3000 1900
Entry Wire Line
	2900 2100 3000 2000
Entry Wire Line
	2900 2200 3000 2100
Entry Wire Line
	2900 2300 3000 2200
Entry Wire Line
	2900 2400 3000 2300
Entry Wire Line
	2900 2500 3000 2400
Entry Wire Line
	2900 2600 3000 2500
Entry Wire Line
	3200 1100 3300 1200
Entry Wire Line
	3200 1200 3300 1300
Entry Wire Line
	3200 1300 3300 1400
Entry Wire Line
	3200 1400 3300 1500
Entry Wire Line
	3200 1500 3300 1600
Entry Wire Line
	3200 1600 3300 1700
Entry Wire Line
	3200 1700 3300 1800
Entry Wire Line
	3200 1800 3300 1900
Entry Wire Line
	3200 1900 3300 2000
Entry Wire Line
	3200 2000 3300 2100
Entry Wire Line
	3200 2100 3300 2200
Entry Wire Line
	3200 2200 3300 2300
Entry Wire Line
	3200 2300 3300 2400
Entry Wire Line
	3200 2400 3300 2500
Entry Wire Line
	3200 2500 3300 2600
Entry Wire Line
	4800 1200 4900 1100
Entry Wire Line
	4800 1300 4900 1200
Entry Wire Line
	4800 1400 4900 1300
Entry Wire Line
	4800 1500 4900 1400
Entry Wire Line
	4800 1600 4900 1500
Entry Wire Line
	4800 1700 4900 1600
Entry Wire Line
	4800 1800 4900 1700
Entry Wire Line
	4800 1900 4900 1800
Text Label 5500 1250 0    60   ~ 0
A0
Text Label 5500 1350 0    60   ~ 0
A1
Text Label 5500 1450 0    60   ~ 0
A2
Text Label 5500 1550 0    60   ~ 0
A3
Text Label 5500 1650 0    60   ~ 0
A4
Text Label 5500 1750 0    60   ~ 0
A5
Text Label 5500 1850 0    60   ~ 0
A6
Text Label 5500 1950 0    60   ~ 0
A7
Text Label 5500 2050 0    60   ~ 0
A8
Text Label 5500 2150 0    60   ~ 0
A9
Text Label 5500 2250 0    60   ~ 0
A10
Text Label 5500 2350 0    60   ~ 0
A11
Text Label 5500 2450 0    60   ~ 0
A12
Text Label 5500 2550 0    60   ~ 0
A13
Text Label 5500 2650 0    60   ~ 0
A14
Text Label 6700 1250 0    60   ~ 0
D0
Text Label 6700 1350 0    60   ~ 0
D1
Text Label 6700 1450 0    60   ~ 0
D2
Text Label 6700 1550 0    60   ~ 0
D3
Text Label 6700 1650 0    60   ~ 0
D4
Text Label 6700 1750 0    60   ~ 0
D5
Text Label 6700 1850 0    60   ~ 0
D6
Text Label 6700 1950 0    60   ~ 0
D7
Entry Wire Line
	5350 1150 5450 1250
Entry Wire Line
	5350 1250 5450 1350
Entry Wire Line
	5350 1350 5450 1450
Entry Wire Line
	5350 1450 5450 1550
Entry Wire Line
	5350 1550 5450 1650
Entry Wire Line
	5350 1650 5450 1750
Entry Wire Line
	5350 1750 5450 1850
Entry Wire Line
	5350 1850 5450 1950
Entry Wire Line
	5350 1950 5450 2050
Entry Wire Line
	5350 2050 5450 2150
Entry Wire Line
	5350 2150 5450 2250
Entry Wire Line
	5350 2250 5450 2350
Entry Wire Line
	5350 2350 5450 2450
Entry Wire Line
	5350 2450 5450 2550
Entry Wire Line
	5350 2550 5450 2650
Entry Wire Line
	6850 1250 6950 1150
Entry Wire Line
	6850 1350 6950 1250
Entry Wire Line
	6850 1450 6950 1350
Entry Wire Line
	6850 1550 6950 1450
Entry Wire Line
	6850 1650 6950 1550
Entry Wire Line
	6850 1750 6950 1650
Entry Wire Line
	6850 1850 6950 1750
Entry Wire Line
	6850 1950 6950 1850
Text Label 6950 4150 0    60   ~ 0
A0
Text Label 6950 4250 0    60   ~ 0
A1
Text Label 6950 4350 0    60   ~ 0
A2
Text Label 6950 4450 0    60   ~ 0
A3
Text Label 6950 4550 0    60   ~ 0
A4
Text Label 6950 4650 0    60   ~ 0
A5
Text Label 6950 4750 0    60   ~ 0
A6
Text Label 6950 4850 0    60   ~ 0
A7
Text Label 6950 4950 0    60   ~ 0
A8
Text Label 6950 5050 0    60   ~ 0
A9
Text Label 6950 5150 0    60   ~ 0
A10
Text Label 6950 5250 0    60   ~ 0
A11
Entry Wire Line
	7200 4150 7300 4050
Entry Wire Line
	7200 4250 7300 4150
Entry Wire Line
	7200 4350 7300 4250
Entry Wire Line
	7200 4450 7300 4350
Entry Wire Line
	7200 4550 7300 4450
Entry Wire Line
	7200 4650 7300 4550
Entry Wire Line
	7200 4750 7300 4650
Entry Wire Line
	7200 4850 7300 4750
Entry Wire Line
	7200 4950 7300 4850
Entry Wire Line
	7200 5050 7300 4950
Entry Wire Line
	7200 5150 7300 5050
Entry Wire Line
	7200 5250 7300 5150
Entry Wire Line
	10450 1250 10550 1150
Entry Wire Line
	10450 1350 10550 1250
Entry Wire Line
	10450 1450 10550 1350
Entry Wire Line
	10450 1550 10550 1450
Entry Wire Line
	10450 1650 10550 1550
Entry Wire Line
	10450 1750 10550 1650
Entry Wire Line
	10450 1850 10550 1750
Entry Wire Line
	10450 1950 10550 1850
Text Label 9750 1250 0    60   ~ 0
D0
Text Label 9750 1350 0    60   ~ 0
D1
Text Label 9750 1450 0    60   ~ 0
D2
Text Label 9750 1550 0    60   ~ 0
D3
Text Label 9750 1650 0    60   ~ 0
D4
Text Label 9750 1750 0    60   ~ 0
D5
Text Label 9750 1850 0    60   ~ 0
D6
Text Label 9750 1950 0    60   ~ 0
D7
Entry Wire Line
	3000 2900 3100 2800
Entry Wire Line
	3000 3000 3100 2900
Entry Wire Line
	3000 3100 3100 3000
Entry Wire Line
	3000 3200 3100 3100
Entry Wire Line
	3000 3300 3100 3200
Entry Wire Line
	3000 3400 3100 3300
Entry Wire Line
	3000 3500 3100 3400
Entry Wire Line
	3000 3600 3100 3500
Text Label 2750 2900 0    60   ~ 0
D0
Text Label 2750 3000 0    60   ~ 0
D1
Text Label 2750 3100 0    60   ~ 0
D2
Text Label 2750 3200 0    60   ~ 0
D3
Text Label 2750 3300 0    60   ~ 0
D4
Text Label 2750 3400 0    60   ~ 0
D5
Text Label 2750 3500 0    60   ~ 0
D6
Text Label 2750 3600 0    60   ~ 0
D7
$Comp
L R R1
U 1 1 586474BE
P 3200 3800
F 0 "R1" V 3280 3800 50  0000 C CNN
F 1 "10k" V 3200 3800 50  0000 C CNN
F 2 "Resistors_ThroughHole:Resistor_Horizontal_RM10mm" V 3130 3800 50  0001 C CNN
F 3 "" H 3200 3800 50  0000 C CNN
	1    3200 3800
	1    0    0    -1  
$EndComp
$Comp
L GND #PWR06
U 1 1 586475C4
P 3200 4200
F 0 "#PWR06" H 3200 3950 50  0001 C CNN
F 1 "GND" H 3200 4050 50  0000 C CNN
F 2 "" H 3200 4200 50  0000 C CNN
F 3 "" H 3200 4200 50  0000 C CNN
	1    3200 4200
	1    0    0    -1  
$EndComp
Text GLabel 3050 4000 0    60   Input ~ 0
~MREQ
NoConn ~ 5250 3850
NoConn ~ 5250 4050
$Comp
L JUMPER3 JP1
U 1 1 58649094
P 900 4800
F 0 "JP1" H 950 4700 50  0000 L CNN
F 1 "JUMPER3" H 900 4900 50  0000 C BNN
F 2 "Pin_Headers:Pin_Header_Straight_1x03" H 900 4800 50  0001 C CNN
F 3 "" H 900 4800 50  0000 C CNN
	1    900  4800
	0    -1   -1   0   
$EndComp
Text GLabel 1500 4700 0    60   Input ~ 0
EXTCLK
Text GLabel 850  4550 0    60   Input ~ 0
~CLK/2
Text GLabel 850  5050 0    60   Input ~ 0
~CLK/4
$Comp
L GND #PWR07
U 1 1 586498FD
P 1600 5900
F 0 "#PWR07" H 1600 5650 50  0001 C CNN
F 1 "GND" H 1600 5750 50  0000 C CNN
F 2 "" H 1600 5900 50  0000 C CNN
F 3 "" H 1600 5900 50  0000 C CNN
	1    1600 5900
	1    0    0    -1  
$EndComp
NoConn ~ 3200 5000
NoConn ~ 3200 5250
NoConn ~ 3200 5500
Text GLabel 1400 5700 0    60   Input ~ 0
~DBGCLK
Text GLabel 7350 1750 0    60   Input ~ 0
~CLK/2
NoConn ~ 7400 1550
Text GLabel 7300 1250 0    60   Input ~ 0
~RESET
$Comp
L R R2
U 1 1 5864B536
P 7350 1050
F 0 "R2" V 7430 1050 50  0000 C CNN
F 1 "4k7" V 7350 1050 50  0000 C CNN
F 2 "Resistors_ThroughHole:Resistor_Horizontal_RM10mm" V 7280 1050 50  0001 C CNN
F 3 "" H 7350 1050 50  0000 C CNN
	1    7350 1050
	1    0    0    -1  
$EndComp
$Comp
L VCC #PWR08
U 1 1 5864B63F
P 7350 900
F 0 "#PWR08" H 7350 750 50  0001 C CNN
F 1 "VCC" H 7350 1050 50  0000 C CNN
F 2 "" H 7350 900 50  0000 C CNN
F 3 "" H 7350 900 50  0000 C CNN
	1    7350 900 
	1    0    0    -1  
$EndComp
$Comp
L VCC #PWR09
U 1 1 5864B67B
P 8550 950
F 0 "#PWR09" H 8550 800 50  0001 C CNN
F 1 "VCC" H 8550 1100 50  0000 C CNN
F 2 "" H 8550 950 50  0000 C CNN
F 3 "" H 8550 950 50  0000 C CNN
	1    8550 950 
	1    0    0    -1  
$EndComp
Text GLabel 4800 2050 2    60   Input ~ 0
~RD
Text GLabel 4800 2150 2    60   Input ~ 0
~WR
$Comp
L GND #PWR010
U 1 1 5864CAD2
P 8550 3050
F 0 "#PWR010" H 8550 2800 50  0001 C CNN
F 1 "GND" H 8550 2900 50  0000 C CNN
F 2 "" H 8550 3050 50  0000 C CNN
F 3 "" H 8550 3050 50  0000 C CNN
	1    8550 3050
	1    0    0    -1  
$EndComp
Text GLabel 6850 2100 2    60   Input ~ 0
~RD
Text GLabel 6850 2200 2    60   Input ~ 0
~WR
Text GLabel 1500 4600 0    60   Input ~ 0
~ALTCLK
Text GLabel 9900 2350 2    60   Input ~ 0
~ALTCLK
Text GLabel 9900 2450 2    60   Input ~ 0
~ENACTR
Text GLabel 9900 2550 2    60   Input ~ 0
~MREQ
Text GLabel 9900 2650 2    60   Input ~ 0
~WR
Text GLabel 9900 2250 2    60   Input ~ 0
~Z80RST
Text GLabel 1050 3100 0    60   Input ~ 0
~Z80RST
$Comp
L VCC #PWR011
U 1 1 5864EFC8
P 11050 2750
F 0 "#PWR011" H 11050 2600 50  0001 C CNN
F 1 "VCC" H 11050 2900 50  0000 C CNN
F 2 "" H 11050 2750 50  0000 C CNN
F 3 "" H 11050 2750 50  0000 C CNN
	1    11050 2750
	1    0    0    -1  
$EndComp
$Comp
L GND #PWR012
U 1 1 5864F159
P 11050 3100
F 0 "#PWR012" H 11050 2850 50  0001 C CNN
F 1 "GND" H 11050 2950 50  0000 C CNN
F 2 "" H 11050 3100 50  0000 C CNN
F 3 "" H 11050 3100 50  0000 C CNN
	1    11050 3100
	1    0    0    -1  
$EndComp
Text GLabel 10350 3050 0    60   Input ~ 0
~RESET
Wire Wire Line
	600  1000 600  3200
Wire Wire Line
	600  2350 1400 2350
Wire Wire Line
	600  2600 1400 2600
Connection ~ 600  2350
Wire Wire Line
	600  2700 1400 2700
Connection ~ 600  2600
Wire Wire Line
	600  3200 1400 3200
Connection ~ 600  2700
Wire Wire Line
	5000 6000 5000 6050
Wire Wire Line
	1050 2950 1100 2950
Wire Wire Line
	1300 2950 1400 2950
Wire Wire Line
	1200 1650 1400 1650
Wire Wire Line
	1200 1550 1400 1550
Wire Wire Line
	1200 1450 1400 1450
Wire Wire Line
	1200 1350 1400 1350
Wire Wire Line
	1200 1250 1400 1250
Wire Wire Line
	1200 2150 1400 2150
Wire Wire Line
	1400 3550 1400 3550
Wire Wire Line
	5400 6000 5400 6050
Wire Wire Line
	5500 6000 5500 6050
Wire Wire Line
	5600 6000 5600 6050
Wire Wire Line
	2700 1200 2900 1200
Wire Wire Line
	2700 1300 2900 1300
Wire Wire Line
	2700 1400 2900 1400
Wire Wire Line
	2700 1500 2900 1500
Wire Wire Line
	2700 1600 2900 1600
Wire Wire Line
	2700 1700 2900 1700
Wire Wire Line
	2700 1800 2900 1800
Wire Wire Line
	2700 1900 2900 1900
Wire Wire Line
	2700 2000 2900 2000
Wire Wire Line
	2700 2100 2900 2100
Wire Wire Line
	2700 2200 2900 2200
Wire Wire Line
	2700 2300 2900 2300
Wire Wire Line
	2700 2400 2900 2400
Wire Wire Line
	2700 2500 2900 2500
Wire Wire Line
	2700 2600 2900 2600
Wire Wire Line
	2700 2700 3200 2700
Wire Wire Line
	3600 1200 3300 1200
Wire Wire Line
	3600 1300 3300 1300
Wire Wire Line
	3600 1400 3300 1400
Wire Wire Line
	3600 1500 3300 1500
Wire Wire Line
	3600 1600 3300 1600
Wire Wire Line
	3600 1700 3300 1700
Wire Wire Line
	3600 1800 3300 1800
Wire Wire Line
	3600 1900 3300 1900
Wire Wire Line
	3600 2000 3300 2000
Wire Wire Line
	3600 2100 3300 2100
Wire Wire Line
	3600 2200 3300 2200
Wire Wire Line
	3600 2300 3300 2300
Wire Wire Line
	3300 2400 3600 2400
Wire Wire Line
	3300 2500 3600 2500
Wire Wire Line
	3600 2600 3300 2600
Wire Wire Line
	4600 1200 4800 1200
Wire Wire Line
	4600 1300 4800 1300
Wire Wire Line
	4600 1400 4800 1400
Wire Wire Line
	4600 1500 4800 1500
Wire Wire Line
	4600 1600 4800 1600
Wire Wire Line
	4600 1700 4800 1700
Wire Wire Line
	4600 1800 4800 1800
Wire Wire Line
	4600 1900 4800 1900
Wire Wire Line
	5650 1250 5450 1250
Wire Wire Line
	5650 1350 5450 1350
Wire Wire Line
	5650 1450 5450 1450
Wire Wire Line
	5650 1550 5450 1550
Wire Wire Line
	5650 1650 5450 1650
Wire Wire Line
	5650 1750 5450 1750
Wire Wire Line
	5650 1850 5450 1850
Wire Wire Line
	5650 1950 5450 1950
Wire Wire Line
	5650 2050 5450 2050
Wire Wire Line
	5650 2150 5450 2150
Wire Wire Line
	5650 2250 5450 2250
Wire Wire Line
	5650 2350 5450 2350
Wire Wire Line
	5650 2450 5450 2450
Wire Wire Line
	5650 2550 5450 2550
Wire Wire Line
	5650 2650 5450 2650
Wire Wire Line
	6650 1250 6850 1250
Wire Wire Line
	6650 1350 6850 1350
Wire Wire Line
	6650 1450 6850 1450
Wire Wire Line
	6650 1550 6850 1550
Wire Wire Line
	6650 1650 6850 1650
Wire Wire Line
	6650 1750 6850 1750
Wire Wire Line
	6650 1850 6850 1850
Wire Wire Line
	6650 1950 6850 1950
Wire Bus Line
	3000 900  3000 2500
Wire Bus Line
	3000 900  5350 900 
Wire Bus Line
	3200 900  3200 2500
Wire Bus Line
	5350 900  5350 3200
Wire Wire Line
	6950 4150 7200 4150
Wire Wire Line
	6950 4250 7200 4250
Wire Wire Line
	6950 4350 7200 4350
Wire Wire Line
	6950 4450 7200 4450
Wire Wire Line
	6950 4550 7200 4550
Wire Wire Line
	6950 4650 7200 4650
Wire Wire Line
	6950 4750 7200 4750
Wire Wire Line
	6950 4850 7200 4850
Wire Wire Line
	6950 4950 7200 4950
Wire Wire Line
	6950 5050 7200 5050
Wire Wire Line
	6950 5150 7200 5150
Wire Wire Line
	6950 5250 7200 5250
Wire Bus Line
	7300 3200 7300 5200
Wire Bus Line
	5350 3200 7300 3200
Wire Wire Line
	9700 1250 10450 1250
Wire Wire Line
	9700 1350 10450 1350
Wire Wire Line
	9700 1450 10450 1450
Wire Wire Line
	9700 1550 10450 1550
Wire Wire Line
	9700 1650 10450 1650
Wire Wire Line
	9700 1750 10450 1750
Wire Wire Line
	9700 1850 10450 1850
Wire Wire Line
	9700 1950 10450 1950
Wire Wire Line
	2700 2900 3000 2900
Wire Wire Line
	2700 3000 3000 3000
Wire Wire Line
	2700 3100 3000 3100
Wire Wire Line
	2700 3200 3000 3200
Wire Wire Line
	2700 3300 3000 3300
Wire Wire Line
	2700 3400 3000 3400
Wire Wire Line
	2700 3500 3000 3500
Wire Wire Line
	2700 3600 3000 3600
Wire Bus Line
	3100 700  3100 3500
Wire Bus Line
	3100 700  10550 700 
Wire Bus Line
	4900 700  4900 1800
Wire Bus Line
	6950 700  6950 1950
Wire Bus Line
	10550 700  10550 1850
Wire Wire Line
	3200 2700 3200 3650
Wire Wire Line
	3200 3650 3550 3650
Connection ~ 3200 3650
Wire Wire Line
	3200 3950 3200 4200
Wire Wire Line
	3200 4100 3400 4100
Wire Wire Line
	3400 4100 3400 3500
Wire Wire Line
	3400 3500 3550 3500
Connection ~ 3200 4100
Wire Wire Line
	3050 4000 3550 4000
Wire Wire Line
	5250 3450 5250 3100
Wire Wire Line
	5250 3100 4600 3100
Wire Wire Line
	4600 3100 4600 2300
Wire Wire Line
	5250 3650 5300 3650
Wire Wire Line
	5300 3650 5300 3100
Wire Wire Line
	5300 3100 6850 3100
Wire Wire Line
	6850 3100 6850 2350
Wire Wire Line
	6850 2350 6650 2350
Wire Wire Line
	5450 3300 9700 3300
Wire Wire Line
	9700 3300 9700 2750
Wire Wire Line
	5650 4450 5550 4450
Wire Wire Line
	5550 4450 5550 3400
Wire Wire Line
	5550 3400 9800 3400
Wire Wire Line
	9800 3400 9800 2150
Wire Wire Line
	9800 2150 9700 2150
Wire Wire Line
	1000 4800 1700 4800
Wire Wire Line
	1500 4700 1700 4700
Wire Wire Line
	850  4550 900  4550
Wire Wire Line
	850  5050 900  5050
Wire Wire Line
	1600 4950 1600 5900
Wire Wire Line
	1600 5800 1700 5800
Wire Wire Line
	1600 5550 1700 5550
Connection ~ 1600 5800
Wire Wire Line
	1600 5450 1700 5450
Connection ~ 1600 5550
Wire Wire Line
	1600 5300 1700 5300
Connection ~ 1600 5450
Wire Wire Line
	1600 5200 1700 5200
Connection ~ 1600 5300
Wire Wire Line
	1700 5050 1600 5050
Connection ~ 1600 5200
Wire Wire Line
	1700 4950 1600 4950
Connection ~ 1600 5050
Wire Wire Line
	1400 5700 1700 5700
Wire Wire Line
	3200 4750 3200 4500
Wire Wire Line
	3200 4500 1400 4500
Wire Wire Line
	1400 4500 1400 3550
Wire Wire Line
	7350 1750 7400 1750
Wire Wire Line
	7300 1250 7400 1250
Wire Wire Line
	7350 1250 7350 1200
Connection ~ 7350 1250
Wire Wire Line
	4600 2050 4800 2050
Wire Wire Line
	4600 2150 4800 2150
Wire Wire Line
	6650 2100 6850 2100
Wire Wire Line
	6650 2200 6850 2200
Wire Wire Line
	9700 2350 9900 2350
Wire Wire Line
	9900 2650 9700 2650
Wire Wire Line
	9900 2550 9700 2550
Wire Wire Line
	9900 2450 9700 2450
Wire Wire Line
	9700 2250 9900 2250
Wire Wire Line
	1050 3100 1350 3100
Wire Wire Line
	1350 3100 1350 2950
Connection ~ 1350 2950
Wire Wire Line
	11050 2750 11050 2850
Wire Wire Line
	11050 2850 10950 2850
Wire Wire Line
	10400 1850 10400 2850
Connection ~ 10400 1850
Wire Wire Line
	10450 2950 10350 2950
Wire Wire Line
	10350 2950 10350 1950
Connection ~ 10350 1950
Wire Wire Line
	11050 3100 11050 3050
Wire Wire Line
	11050 3050 10950 3050
Wire Wire Line
	10350 3050 10450 3050
Wire Wire Line
	10400 2850 10450 2850
Wire Wire Line
	10950 2950 10950 2700
Wire Wire Line
	10950 2700 10450 2700
Wire Wire Line
	10450 2700 10450 1750
Connection ~ 10450 1750
Text GLabel 5200 6000 1    60   Input ~ 0
~CLK/2
Text GLabel 5100 6000 1    60   Input ~ 0
~CLK/4
Wire Wire Line
	5200 6050 5200 6000
Wire Wire Line
	5100 6000 5100 6050
Text GLabel 5300 6000 1    60   Input ~ 0
~CLK
Wire Wire Line
	5300 6000 5300 6050
Wire Wire Line
	4200 6050 4200 5900
Wire Wire Line
	4300 6050 4300 5900
Wire Wire Line
	4400 6050 4400 5900
Wire Wire Line
	4500 6050 4500 5900
Wire Wire Line
	4600 6050 4600 5900
Wire Wire Line
	4700 6050 4700 5900
Wire Wire Line
	4800 6050 4800 5900
Wire Wire Line
	4900 6050 4900 5900
Text Label 4200 6000 1    60   ~ 0
D0
Text Label 4300 6000 1    60   ~ 0
D1
Text Label 4400 6000 1    60   ~ 0
D2
Text Label 4500 6000 1    60   ~ 0
D3
Text Label 4600 6000 1    60   ~ 0
D4
Text Label 4700 6000 1    60   ~ 0
D5
Text Label 4800 6000 1    60   ~ 0
D6
Text Label 4900 6000 1    60   ~ 0
D7
Wire Wire Line
	4100 6050 4100 5900
Wire Wire Line
	4000 6050 4000 5900
Wire Wire Line
	3900 6050 3900 5900
Wire Wire Line
	3800 6050 3800 5900
Text Label 4100 5900 3    60   ~ 0
A0
Text Label 4000 5900 3    60   ~ 0
A1
Text Label 3900 5900 3    60   ~ 0
A2
Text Label 3800 5900 3    60   ~ 0
A3
Wire Bus Line
	6950 1950 7450 1950
Wire Wire Line
	8150 4200 8000 4200
Wire Wire Line
	8150 4300 8000 4300
Wire Wire Line
	8150 4400 8000 4400
Wire Wire Line
	8150 4500 8000 4500
Wire Wire Line
	8150 4600 8000 4600
Wire Wire Line
	8150 4700 8000 4700
Wire Wire Line
	8150 4800 8000 4800
Wire Wire Line
	8150 4900 8000 4900
Text Label 8150 4200 2    60   ~ 0
D0
Text Label 8150 4300 2    60   ~ 0
D1
Text Label 8150 4400 2    60   ~ 0
D2
Text Label 8150 4500 2    60   ~ 0
D3
Text Label 8150 4600 2    60   ~ 0
D4
Text Label 8150 4700 2    60   ~ 0
D5
Text Label 8150 4800 2    60   ~ 0
D6
Text Label 8150 4900 2    60   ~ 0
D7
$Comp
L VCC #PWR013
U 1 1 586540E1
P 8050 3900
F 0 "#PWR013" H 8050 3750 50  0001 C CNN
F 1 "VCC" H 8050 4050 50  0000 C CNN
F 2 "" H 8050 3900 50  0000 C CNN
F 3 "" H 8050 3900 50  0000 C CNN
	1    8050 3900
	1    0    0    -1  
$EndComp
Wire Wire Line
	8150 4000 8050 4000
Wire Wire Line
	8050 3900 8050 4100
Wire Wire Line
	8050 4100 8150 4100
Connection ~ 8050 4000
$Comp
L GND #PWR014
U 1 1 58654456
P 8800 6000
F 0 "#PWR014" H 8800 5750 50  0001 C CNN
F 1 "GND" H 8800 5850 50  0000 C CNN
F 2 "" H 8800 6000 50  0000 C CNN
F 3 "" H 8800 6000 50  0000 C CNN
	1    8800 6000
	1    0    0    -1  
$EndComp
Wire Wire Line
	8800 5800 8800 6000
Wire Wire Line
	8800 5900 8650 5900
Wire Wire Line
	8650 5800 8800 5800
Connection ~ 8800 5900
Text GLabel 8050 5100 0    60   Input ~ 0
~RESET
Text GLabel 8050 5200 0    60   Input ~ 0
~MREQ
Text GLabel 8050 5300 0    60   Input ~ 0
~IORQ
Text GLabel 8050 5400 0    60   Input ~ 0
~RD
Text GLabel 8050 5500 0    60   Input ~ 0
~WR
Text GLabel 8050 5600 0    60   Input ~ 0
~M1
Text GLabel 8050 5700 0    60   Input ~ 0
EXTCLK
Text GLabel 8050 5800 0    60   Input ~ 0
~DBGCLK
Wire Wire Line
	8050 5100 8150 5100
Wire Wire Line
	8050 5200 8150 5200
Wire Wire Line
	8050 5300 8150 5300
Wire Wire Line
	8050 5400 8150 5400
Wire Wire Line
	8050 5500 8150 5500
Wire Wire Line
	8050 5600 8150 5600
Wire Wire Line
	8050 5700 8150 5700
Wire Wire Line
	8050 5800 8150 5800
Text Label 8650 4000 0    60   ~ 0
A0
Text Label 8650 4100 0    60   ~ 0
A1
Text Label 8650 4200 0    60   ~ 0
A2
Text Label 8650 4300 0    60   ~ 0
A3
Text Label 8650 4400 0    60   ~ 0
A4
Text Label 8650 4500 0    60   ~ 0
A5
Text Label 8650 4600 0    60   ~ 0
A6
Text Label 8650 4700 0    60   ~ 0
A7
Text Label 8650 4800 0    60   ~ 0
A8
Text Label 8650 4900 0    60   ~ 0
A9
Text Label 8650 5000 0    60   ~ 0
A10
Text Label 8650 5100 0    60   ~ 0
A11
Text Label 8650 5200 0    60   ~ 0
A12
Text Label 8650 5300 0    60   ~ 0
A13
Text Label 8650 5400 0    60   ~ 0
A14
Text Label 8650 5500 0    60   ~ 0
A15
Wire Wire Line
	8650 4000 8850 4000
Wire Wire Line
	8650 4100 8850 4100
Wire Wire Line
	8650 4200 8850 4200
Wire Wire Line
	8650 4300 8850 4300
Wire Wire Line
	8650 4400 8850 4400
Wire Wire Line
	8650 4500 8850 4500
Wire Wire Line
	8650 4600 8850 4600
Wire Wire Line
	8650 4700 8850 4700
Wire Wire Line
	8650 4800 8850 4800
Wire Wire Line
	8650 4900 8850 4900
Wire Wire Line
	8650 5000 8850 5000
Wire Wire Line
	8650 5100 8850 5100
Wire Wire Line
	8650 5200 8850 5200
Wire Wire Line
	8650 5300 8850 5300
Wire Wire Line
	8650 5400 8850 5400
Wire Wire Line
	8650 5500 8850 5500
NoConn ~ 8150 5000
NoConn ~ 8650 5700
Text GLabel 8800 5600 2    60   Input ~ 0
~HALT
Wire Wire Line
	8800 5600 8650 5600
NoConn ~ 8150 5900
$Comp
L VCC #PWR015
U 1 1 58658371
P 6300 3700
F 0 "#PWR015" H 6300 3550 50  0001 C CNN
F 1 "VCC" H 6300 3850 50  0000 C CNN
F 2 "" H 6300 3700 50  0000 C CNN
F 3 "" H 6300 3700 50  0000 C CNN
	1    6300 3700
	1    0    0    -1  
$EndComp
$Comp
L 2N7002 Q1
U 1 1 58658A99
P 6200 3900
F 0 "Q1" H 6400 3975 50  0000 L CNN
F 1 "2N7002" H 6400 3900 50  0000 L CNN
F 2 "TO_SOT_Packages_THT:TO-92_Inline_Wide" H 6400 3825 50  0001 L CIN
F 3 "" H 6200 3900 50  0000 L CNN
	1    6200 3900
	1    0    0    -1  
$EndComp
Text GLabel 6000 3950 0    60   Input ~ 0
~ENACTR
Wire Wire Line
	5450 3300 5450 4150
Wire Wire Line
	5450 4150 5650 4150
$Comp
L VCC #PWR016
U 1 1 58659189
P 3700 7300
F 0 "#PWR016" H 3700 7150 50  0001 C CNN
F 1 "VCC" H 3700 7450 50  0000 C CNN
F 2 "" H 3700 7300 50  0000 C CNN
F 3 "" H 3700 7300 50  0000 C CNN
	1    3700 7300
	1    0    0    -1  
$EndComp
$Comp
L PWR_FLAG #FLG017
U 1 1 586591CA
P 4000 7300
F 0 "#FLG017" H 4000 7395 50  0001 C CNN
F 1 "PWR_FLAG" H 4000 7480 50  0000 C CNN
F 2 "" H 4000 7300 50  0000 C CNN
F 3 "" H 4000 7300 50  0000 C CNN
	1    4000 7300
	1    0    0    -1  
$EndComp
Wire Wire Line
	3700 7300 4000 7300
$Comp
L GND #PWR018
U 1 1 5865BE78
P 6300 5300
F 0 "#PWR018" H 6300 5050 50  0001 C CNN
F 1 "GND" H 6300 5150 50  0000 C CNN
F 2 "" H 6300 5300 50  0000 C CNN
F 3 "" H 6300 5300 50  0000 C CNN
	1    6300 5300
	1    0    0    -1  
$EndComp
$Comp
L R R5
U 1 1 5865D9D7
P 3600 2900
F 0 "R5" V 3650 2700 50  0000 C CNN
F 1 "10k" V 3600 2900 50  0000 C CNN
F 2 "Resistors_ThroughHole:Resistor_Horizontal_RM10mm" V 3530 2900 50  0001 C CNN
F 3 "" H 3600 2900 50  0000 C CNN
	1    3600 2900
	1    0    0    -1  
$EndComp
$Comp
L R R4
U 1 1 5865DA7B
P 3500 2900
F 0 "R4" V 3550 2700 50  0000 C CNN
F 1 "10k" V 3500 2900 50  0000 C CNN
F 2 "Resistors_ThroughHole:Resistor_Horizontal_RM10mm" V 3430 2900 50  0001 C CNN
F 3 "" H 3500 2900 50  0000 C CNN
	1    3500 2900
	1    0    0    -1  
$EndComp
$Comp
L R R3
U 1 1 5865DAE5
P 3400 2900
F 0 "R3" V 3450 2700 50  0000 C CNN
F 1 "10k" V 3400 2900 50  0000 C CNN
F 2 "Resistors_ThroughHole:Resistor_Horizontal_RM10mm" V 3330 2900 50  0001 C CNN
F 3 "" H 3400 2900 50  0000 C CNN
	1    3400 2900
	1    0    0    -1  
$EndComp
Wire Wire Line
	3600 2750 3600 2600
Wire Wire Line
	3500 2750 3500 2500
Connection ~ 3500 2500
Wire Wire Line
	3400 2750 3400 2400
Connection ~ 3400 2400
Connection ~ 3600 2600
$Comp
L GND #PWR019
U 1 1 5865E46E
P 3400 3250
F 0 "#PWR019" H 3400 3000 50  0001 C CNN
F 1 "GND" H 3400 3100 50  0000 C CNN
F 2 "" H 3400 3250 50  0000 C CNN
F 3 "" H 3400 3250 50  0000 C CNN
	1    3400 3250
	1    0    0    -1  
$EndComp
Wire Wire Line
	3400 3050 3400 3250
Wire Wire Line
	3400 3200 3600 3200
Wire Wire Line
	3500 3200 3500 3050
Connection ~ 3400 3200
Wire Wire Line
	3600 3200 3600 3050
Connection ~ 3500 3200
$Comp
L C C1
U 1 1 586626D9
P 1200 7200
F 0 "C1" H 1225 7300 50  0000 L CNN
F 1 "0.1uF" H 1225 7100 50  0000 L CNN
F 2 "Capacitors_ThroughHole:C_Disc_D3_P2.5" H 1350 7050 50  0001 C CNN
F 3 "" H 1200 7200 50  0000 C CNN
	1    1200 7200
	1    0    0    -1  
$EndComp
$Comp
L VCC #PWR020
U 1 1 58662776
P 1200 7050
F 0 "#PWR020" H 1200 6900 50  0001 C CNN
F 1 "VCC" H 1200 7200 50  0000 C CNN
F 2 "" H 1200 7050 50  0000 C CNN
F 3 "" H 1200 7050 50  0000 C CNN
	1    1200 7050
	1    0    0    -1  
$EndComp
$Comp
L GND #PWR021
U 1 1 586627B0
P 1200 7350
F 0 "#PWR021" H 1200 7100 50  0001 C CNN
F 1 "GND" H 1200 7200 50  0000 C CNN
F 2 "" H 1200 7350 50  0000 C CNN
F 3 "" H 1200 7350 50  0000 C CNN
	1    1200 7350
	1    0    0    -1  
$EndComp
$Comp
L C C2
U 1 1 58662A5D
P 1550 7200
F 0 "C2" H 1575 7300 50  0000 L CNN
F 1 "0.1uF" H 1575 7100 50  0000 L CNN
F 2 "Capacitors_ThroughHole:C_Disc_D3_P2.5" H 1700 7050 50  0001 C CNN
F 3 "" H 1550 7200 50  0000 C CNN
	1    1550 7200
	1    0    0    -1  
$EndComp
$Comp
L VCC #PWR022
U 1 1 58662A63
P 1550 7050
F 0 "#PWR022" H 1550 6900 50  0001 C CNN
F 1 "VCC" H 1550 7200 50  0000 C CNN
F 2 "" H 1550 7050 50  0000 C CNN
F 3 "" H 1550 7050 50  0000 C CNN
	1    1550 7050
	1    0    0    -1  
$EndComp
$Comp
L GND #PWR023
U 1 1 58662A69
P 1550 7350
F 0 "#PWR023" H 1550 7100 50  0001 C CNN
F 1 "GND" H 1550 7200 50  0000 C CNN
F 2 "" H 1550 7350 50  0000 C CNN
F 3 "" H 1550 7350 50  0000 C CNN
	1    1550 7350
	1    0    0    -1  
$EndComp
$Comp
L C C3
U 1 1 58662B0B
P 1900 7200
F 0 "C3" H 1925 7300 50  0000 L CNN
F 1 "0.1uF" H 1925 7100 50  0000 L CNN
F 2 "Capacitors_ThroughHole:C_Disc_D3_P2.5" H 2050 7050 50  0001 C CNN
F 3 "" H 1900 7200 50  0000 C CNN
	1    1900 7200
	1    0    0    -1  
$EndComp
$Comp
L VCC #PWR024
U 1 1 58662B11
P 1900 7050
F 0 "#PWR024" H 1900 6900 50  0001 C CNN
F 1 "VCC" H 1900 7200 50  0000 C CNN
F 2 "" H 1900 7050 50  0000 C CNN
F 3 "" H 1900 7050 50  0000 C CNN
	1    1900 7050
	1    0    0    -1  
$EndComp
$Comp
L GND #PWR025
U 1 1 58662B17
P 1900 7350
F 0 "#PWR025" H 1900 7100 50  0001 C CNN
F 1 "GND" H 1900 7200 50  0000 C CNN
F 2 "" H 1900 7350 50  0000 C CNN
F 3 "" H 1900 7350 50  0000 C CNN
	1    1900 7350
	1    0    0    -1  
$EndComp
$Comp
L C C4
U 1 1 58662B1D
P 2250 7200
F 0 "C4" H 2275 7300 50  0000 L CNN
F 1 "0.1uF" H 2275 7100 50  0000 L CNN
F 2 "Capacitors_ThroughHole:C_Disc_D3_P2.5" H 2400 7050 50  0001 C CNN
F 3 "" H 2250 7200 50  0000 C CNN
	1    2250 7200
	1    0    0    -1  
$EndComp
$Comp
L VCC #PWR026
U 1 1 58662B23
P 2250 7050
F 0 "#PWR026" H 2250 6900 50  0001 C CNN
F 1 "VCC" H 2250 7200 50  0000 C CNN
F 2 "" H 2250 7050 50  0000 C CNN
F 3 "" H 2250 7050 50  0000 C CNN
	1    2250 7050
	1    0    0    -1  
$EndComp
$Comp
L GND #PWR027
U 1 1 58662B29
P 2250 7350
F 0 "#PWR027" H 2250 7100 50  0001 C CNN
F 1 "GND" H 2250 7200 50  0000 C CNN
F 2 "" H 2250 7350 50  0000 C CNN
F 3 "" H 2250 7350 50  0000 C CNN
	1    2250 7350
	1    0    0    -1  
$EndComp
$Comp
L C C5
U 1 1 58662BF5
P 2600 7200
F 0 "C5" H 2625 7300 50  0000 L CNN
F 1 "0.1uF" H 2625 7100 50  0000 L CNN
F 2 "Capacitors_ThroughHole:C_Disc_D3_P2.5" H 2750 7050 50  0001 C CNN
F 3 "" H 2600 7200 50  0000 C CNN
	1    2600 7200
	1    0    0    -1  
$EndComp
$Comp
L VCC #PWR028
U 1 1 58662BFB
P 2600 7050
F 0 "#PWR028" H 2600 6900 50  0001 C CNN
F 1 "VCC" H 2600 7200 50  0000 C CNN
F 2 "" H 2600 7050 50  0000 C CNN
F 3 "" H 2600 7050 50  0000 C CNN
	1    2600 7050
	1    0    0    -1  
$EndComp
$Comp
L GND #PWR029
U 1 1 58662C01
P 2600 7350
F 0 "#PWR029" H 2600 7100 50  0001 C CNN
F 1 "GND" H 2600 7200 50  0000 C CNN
F 2 "" H 2600 7350 50  0000 C CNN
F 3 "" H 2600 7350 50  0000 C CNN
	1    2600 7350
	1    0    0    -1  
$EndComp
$Comp
L HM62256BLP-7 U5
U 1 1 586639ED
P 6150 2000
F 0 "U5" H 5850 2900 50  0000 C CNN
F 1 "HM62256BLP-7" H 6550 1200 50  0000 C CNN
F 2 "Housings_DIP:DIP-28_W15.24mm_LongPads" H 6200 1100 50  0001 C CIN
F 3 "" H 6150 2000 50  0000 C CNN
	1    6150 2000
	1    0    0    -1  
$EndComp
$Comp
L 74LS139 U4
U 2 1 58664659
P 5900 7200
F 0 "U4" H 5900 7300 50  0000 C CNN
F 1 "74HC139" H 5900 7100 50  0000 C CNN
F 2 "Housings_DIP:DIP-14_W7.62mm_LongPads" H 5900 7200 50  0001 C CNN
F 3 "" H 5900 7200 50  0000 C CNN
	2    5900 7200
	1    0    0    -1  
$EndComp
NoConn ~ 6750 6900
NoConn ~ 6750 7100
NoConn ~ 6750 7300
NoConn ~ 6750 7500
NoConn ~ 5050 7450
NoConn ~ 5050 7100
NoConn ~ 5050 6950
$Comp
L CONN_02X20 P1
U 1 1 58643529
P 8400 4950
F 0 "P1" H 8400 6000 50  0000 C CNN
F 1 "CONN_02X20" V 8400 4950 50  0000 C CNN
F 2 "Pin_Headers:Pin_Header_Straight_2x20" H 8400 4000 50  0001 C CNN
F 3 "" H 8400 4000 50  0000 C CNN
	1    8400 4950
	1    0    0    -1  
$EndComp
$Comp
L CONN_01X24 P4
U 1 1 58668E82
P 4850 6250
F 0 "P4" H 4850 7500 50  0000 C CNN
F 1 "CONN_01X24" V 4950 6250 50  0000 C CNN
F 2 "Pin_Headers:Pin_Header_Angled_1x24" H 4850 6250 50  0001 C CNN
F 3 "" H 4850 6250 50  0000 C CNN
	1    4850 6250
	0    1    1    0   
$EndComp
Wire Wire Line
	3700 5900 3700 6050
Wire Wire Line
	6000 6050 6300 6050
Wire Wire Line
	6300 6050 6300 6400
NoConn ~ 5700 6050
NoConn ~ 5800 6050
NoConn ~ 5900 6050
Wire Wire Line
	1500 4600 1650 4600
Wire Wire Line
	1650 4600 1650 4700
Connection ~ 1650 4700
Text Notes 4950 6550 2    60   ~ 0
Mudar
$EndSCHEMATC
