EESchema Schematic File Version 2
LIBS:computer-rescue
LIBS:power
LIBS:device
LIBS:transistors
LIBS:conn
LIBS:linear
LIBS:regul
LIBS:74xx
LIBS:cmos4000
LIBS:adc-dac
LIBS:memory
LIBS:xilinx
LIBS:microcontrollers
LIBS:dsp
LIBS:microchip
LIBS:analog_switches
LIBS:motorola
LIBS:texas
LIBS:intel
LIBS:audio
LIBS:interface
LIBS:digital-audio
LIBS:philips
LIBS:display
LIBS:cypress
LIBS:siliconi
LIBS:opto
LIBS:atmel
LIBS:contrib
LIBS:valves
LIBS:vga
LIBS:computer-cache
EELAYER 25 0
EELAYER END
$Descr A4 11693 8268
encoding utf-8
Sheet 2 5
Title ""
Date "11 dec 2016"
Rev ""
Comp ""
Comment1 ""
Comment2 ""
Comment3 ""
Comment4 ""
$EndDescr
$Comp
L GND-RESCUE-computer #PWR30
U 1 1 58452CBB
P 10700 5900
F 0 "#PWR30" H 10700 5650 50  0001 C CNN
F 1 "GND" H 10700 5750 50  0000 C CNN
F 2 "" H 10700 5900 50  0000 C CNN
F 3 "" H 10700 5900 50  0000 C CNN
	1    10700 5900
	1    0    0    -1  
$EndComp
$Comp
L VCC #PWR28
U 1 1 58453B50
P 9800 3900
F 0 "#PWR28" H 9800 3750 50  0001 C CNN
F 1 "VCC" H 9800 4050 50  0000 C CNN
F 2 "" H 9800 3900 50  0000 C CNN
F 3 "" H 9800 3900 50  0000 C CNN
	1    9800 3900
	1    0    0    -1  
$EndComp
Text GLabel 9900 4150 0    60   Input ~ 0
D0
Text GLabel 9900 4250 0    60   Input ~ 0
D1
Text GLabel 9900 4350 0    60   Input ~ 0
D2
Text GLabel 9900 4450 0    60   Input ~ 0
D3
Text GLabel 9900 4550 0    60   Input ~ 0
D4
Text GLabel 9900 4650 0    60   Input ~ 0
D5
Text GLabel 9900 4750 0    60   Input ~ 0
D6
Text GLabel 9900 4850 0    60   Input ~ 0
D7
Text GLabel 10600 3950 2    60   Input ~ 0
A0
Text GLabel 10600 4050 2    60   Input ~ 0
A1
Text GLabel 10600 4150 2    60   Input ~ 0
A2
Text GLabel 10600 4250 2    60   Input ~ 0
A3
Text GLabel 10600 4350 2    60   Input ~ 0
A4
Text GLabel 10600 4450 2    60   Input ~ 0
A5
Text GLabel 10600 4550 2    60   Input ~ 0
A6
Text GLabel 10600 4650 2    60   Input ~ 0
A7
Text GLabel 10600 4750 2    60   Input ~ 0
A8
Text GLabel 10600 4850 2    60   Input ~ 0
A9
Text GLabel 10600 4950 2    60   Input ~ 0
A10
Text GLabel 10600 5050 2    60   Input ~ 0
A11
Text GLabel 10600 5150 2    60   Input ~ 0
A12
Text GLabel 10600 5250 2    60   Input ~ 0
A13
Text GLabel 10600 5350 2    60   Input ~ 0
A14
Text GLabel 10600 5450 2    60   Input ~ 0
A15
Text GLabel 9900 5050 0    60   Input ~ 0
~MREQ
Text GLabel 9900 5150 0    60   Input ~ 0
~IORQ
Text GLabel 9900 5250 0    60   Input ~ 0
~RD
Text GLabel 9900 5350 0    60   Input ~ 0
~WR
Text GLabel 9900 5450 0    60   Input ~ 0
~M1
Text GLabel 9900 5550 0    60   Input ~ 0
~EXTCLK
Text GLabel 9900 5650 0    60   Input ~ 0
~DBGCLK
Text GLabel 9900 4950 0    60   Input ~ 0
~RESET
Text Notes 9800 6250 0    60   ~ 0
Connector to debugger
Text GLabel 1600 950  0    60   Input ~ 0
~CLK/4
Text GLabel 1600 1050 0    60   Input ~ 0
~EXTCLK
Text GLabel 1050 1950 0    60   Input ~ 0
~DBGCLK
$Comp
L R-RESCUE-computer R6
U 1 1 584560A8
P 1250 1650
F 0 "R6" V 1330 1650 50  0000 C CNN
F 1 "R" V 1250 1650 50  0000 C CNN
F 2 "2k2" V 1150 1650 50  0000 C CNN
F 3 "" H 1250 1650 50  0000 C CNN
	1    1250 1650
	1    0    0    -1  
$EndComp
$Comp
L VCC #PWR16
U 1 1 58456167
P 1250 1400
F 0 "#PWR16" H 1250 1250 50  0001 C CNN
F 1 "VCC" H 1250 1550 50  0000 C CNN
F 2 "" H 1250 1400 50  0000 C CNN
F 3 "" H 1250 1400 50  0000 C CNN
	1    1250 1400
	1    0    0    -1  
$EndComp
$Comp
L 74LS157 U6
U 1 1 584564D4
P 2450 1500
F 0 "U6" H 2500 1650 50  0000 C CNN
F 1 "74HC157" H 2500 1350 50  0000 C CNN
F 2 "" H 2450 1500 50  0000 C CNN
F 3 "" H 2450 1500 50  0000 C CNN
	1    2450 1500
	1    0    0    -1  
$EndComp
$Comp
L GND-RESCUE-computer #PWR17
U 1 1 58456CB7
P 1550 2200
F 0 "#PWR17" H 1550 1950 50  0001 C CNN
F 1 "GND" H 1550 2050 50  0000 C CNN
F 2 "" H 1550 2200 50  0000 C CNN
F 3 "" H 1550 2200 50  0000 C CNN
	1    1550 2200
	1    0    0    -1  
$EndComp
NoConn ~ 3200 1750
NoConn ~ 3200 1500
NoConn ~ 3200 1250
Text GLabel 3350 1000 2    60   Input ~ 0
~CPUCLK
$Comp
L HM62256BLP-7-RESCUE-computer U7
U 1 1 584572B8
P 4200 4700
F 0 "U7" H 3900 5600 50  0000 C CNN
F 1 "HM62256BLP-7" H 4600 3900 50  0000 C CNN
F 2 "DIP28" H 4200 4700 50  0000 C CIN
F 3 "" H 4200 4700 50  0000 C CNN
	1    4200 4700
	1    0    0    -1  
$EndComp
$Comp
L ATTINY2313-P IC1
U 1 1 584573BC
P 6200 2000
F 0 "IC1" H 5250 3000 50  0000 C CNN
F 1 "ATTINY2313-P" H 7000 1100 50  0000 C CNN
F 2 "DIP20" H 6200 2000 50  0000 C CIN
F 3 "" H 6200 2000 50  0000 C CNN
	1    6200 2000
	1    0    0    -1  
$EndComp
$Comp
L 74LS139 U8
U 1 1 58457C15
P 4350 6200
F 0 "U8" H 4350 6300 50  0000 C CNN
F 1 "74HC139" H 4350 6100 50  0000 C CNN
F 2 "" H 4350 6200 50  0000 C CNN
F 3 "" H 4350 6200 50  0000 C CNN
	1    4350 6200
	1    0    0    -1  
$EndComp
Text GLabel 1300 4000 0    60   Input ~ 0
~M1
Text GLabel 1300 4100 0    60   Input ~ 0
~MREQ
Text GLabel 1300 4200 0    60   Input ~ 0
~IORQ
Text GLabel 1300 4300 0    60   Input ~ 0
~RW
Text GLabel 1300 4400 0    60   Input ~ 0
~WR
NoConn ~ 1450 4650
Text GLabel 10600 5550 2    60   Input ~ 0
~HALT
Text GLabel 1300 4900 0    60   Input ~ 0
~HALT
Text GLabel 800  5700 0    60   Input ~ 0
~RESET
Text GLabel 1300 6300 0    60   Input ~ 0
~CPUCLK
Entry Wire Line
	2750 3950 2850 3850
Entry Wire Line
	2750 4050 2850 3950
Entry Wire Line
	2750 4150 2850 4050
Entry Wire Line
	2750 4250 2850 4150
Entry Wire Line
	2750 4350 2850 4250
Entry Wire Line
	2750 4450 2850 4350
Entry Wire Line
	2750 4550 2850 4450
Entry Wire Line
	2750 4650 2850 4550
Entry Wire Line
	2750 4750 2850 4650
Entry Wire Line
	2750 4850 2850 4750
Entry Wire Line
	2750 4950 2850 4850
Entry Wire Line
	2750 5050 2850 4950
Entry Wire Line
	2750 5150 2850 5050
Entry Wire Line
	2750 5250 2850 5150
Entry Wire Line
	2750 5350 2850 5250
Entry Wire Line
	2950 5650 3050 5550
Entry Wire Line
	2950 5750 3050 5650
Entry Wire Line
	2950 5850 3050 5750
Entry Wire Line
	2950 5950 3050 5850
Entry Wire Line
	2950 6050 3050 5950
Entry Wire Line
	2950 6150 3050 6050
Entry Wire Line
	2950 6250 3050 6150
Entry Wire Line
	2950 6350 3050 6250
Entry Wire Line
	3600 3850 3700 3950
Entry Wire Line
	3600 3950 3700 4050
Entry Wire Line
	3600 4050 3700 4150
Entry Wire Line
	3600 4150 3700 4250
Entry Wire Line
	3600 4250 3700 4350
Entry Wire Line
	3600 4350 3700 4450
Entry Wire Line
	3600 4450 3700 4550
Entry Wire Line
	3600 4550 3700 4650
Entry Wire Line
	3600 4650 3700 4750
Entry Wire Line
	3600 4750 3700 4850
Entry Wire Line
	3600 4850 3700 4950
Entry Wire Line
	3600 4950 3700 5050
Entry Wire Line
	3600 5050 3700 5150
Entry Wire Line
	3600 5150 3700 5250
Entry Wire Line
	3600 5250 3700 5350
$Comp
L Z80 U5
U 1 1 58458D44
P 2100 5100
F 0 "U5" H 2100 5100 60  0000 C CNN
F 1 "Z80" H 2400 3650 60  0000 C CNN
F 2 "" H 2100 5100 60  0001 C CNN
F 3 "" H 2100 5100 60  0001 C CNN
	1    2100 5100
	1    0    0    -1  
$EndComp
NoConn ~ 1450 6050
$Comp
L CONN_02X20 P3
U 1 1 5845E232
P 10250 4900
F 0 "P3" H 10250 5950 50  0000 C CNN
F 1 "CONN_02X20" V 10250 4900 50  0000 C CNN
F 2 "" H 10250 3950 50  0000 C CNN
F 3 "" H 10250 3950 50  0000 C CNN
	1    10250 4900
	1    0    0    -1  
$EndComp
Entry Wire Line
	4700 3950 4800 3850
Entry Wire Line
	4700 4050 4800 3950
Entry Wire Line
	4700 4150 4800 4050
Entry Wire Line
	4700 4250 4800 4150
Entry Wire Line
	4700 4350 4800 4250
Entry Wire Line
	4700 4450 4800 4350
Entry Wire Line
	4700 4550 4800 4450
Entry Wire Line
	4700 4650 4800 4550
$Comp
L HM62256BLP-7-RESCUE-computer U9
U 1 1 5845EF5C
P 6050 4700
F 0 "U9" H 5750 5600 50  0000 C CNN
F 1 "HM62256BLP-7" H 6450 3900 50  0000 C CNN
F 2 "DIP28" H 6050 4700 50  0000 C CIN
F 3 "" H 6050 4700 50  0000 C CNN
	1    6050 4700
	1    0    0    -1  
$EndComp
Entry Wire Line
	5450 3850 5550 3950
Entry Wire Line
	5450 3950 5550 4050
Entry Wire Line
	5450 4050 5550 4150
Entry Wire Line
	5450 4150 5550 4250
Entry Wire Line
	5450 4250 5550 4350
Entry Wire Line
	5450 4350 5550 4450
Entry Wire Line
	5450 4450 5550 4550
Entry Wire Line
	5450 4550 5550 4650
Entry Wire Line
	5450 4650 5550 4750
Entry Wire Line
	5450 4750 5550 4850
Entry Wire Line
	5450 4850 5550 4950
Entry Wire Line
	5450 4950 5550 5050
Entry Wire Line
	5450 5050 5550 5150
Entry Wire Line
	5450 5150 5550 5250
Entry Wire Line
	5450 5250 5550 5350
Entry Wire Line
	6550 3950 6650 3850
Entry Wire Line
	6550 4050 6650 3950
Entry Wire Line
	6550 4150 6650 4050
Entry Wire Line
	6550 4250 6650 4150
Entry Wire Line
	6550 4350 6650 4250
Entry Wire Line
	6550 4450 6650 4350
Entry Wire Line
	6550 4550 6650 4450
Entry Wire Line
	6550 4650 6650 4550
Entry Bus Bus
	2850 3700 2950 3600
Entry Bus Bus
	5350 3600 5450 3700
Entry Bus Bus
	3500 3600 3600 3700
Text Label 4000 3600 0    60   ~ 0
ADDR
Entry Bus Bus
	4700 3400 4800 3500
Entry Bus Bus
	6550 3400 6650 3500
Entry Bus Bus
	3050 3500 3150 3400
Text Label 4450 3400 0    60   ~ 0
DATA
$Comp
L GND-RESCUE-computer #PWR21
U 1 1 58460280
P 3450 6600
F 0 "#PWR21" H 3450 6350 50  0001 C CNN
F 1 "GND" H 3450 6450 50  0000 C CNN
F 2 "" H 3450 6600 50  0000 C CNN
F 3 "" H 3450 6600 50  0000 C CNN
	1    3450 6600
	1    0    0    -1  
$EndComp
NoConn ~ 5200 6300
NoConn ~ 5200 6500
Text GLabel 3350 6450 0    60   Input ~ 0
~MREQ
Text GLabel 4900 4800 2    60   Input ~ 0
~RW
Text GLabel 4900 4900 2    60   Input ~ 0
~WR
Text GLabel 6750 4800 2    60   Input ~ 0
~RW
Text GLabel 6750 4900 2    60   Input ~ 0
~WR
$Comp
L 4040 U10
U 1 1 58461D04
P 8000 4600
F 0 "U10" H 8100 5250 50  0000 C CNN
F 1 "4040" H 8250 3950 50  0000 C CNN
F 2 "" H 8000 4600 60  0001 C CNN
F 3 "" H 8000 4600 60  0001 C CNN
	1    8000 4600
	1    0    0    -1  
$EndComp
Entry Bus Bus
	8650 3600 8750 3700
Entry Wire Line
	8750 3950 8650 4050
Entry Wire Line
	8750 4050 8650 4150
Entry Wire Line
	8750 4150 8650 4250
Entry Wire Line
	8750 4250 8650 4350
Entry Wire Line
	8750 4350 8650 4450
Entry Wire Line
	8750 4450 8650 4550
Entry Wire Line
	8750 4550 8650 4650
Entry Wire Line
	8750 4650 8650 4750
Entry Wire Line
	8750 4750 8650 4850
Entry Wire Line
	8750 4850 8650 4950
Entry Wire Line
	8750 4950 8650 5050
Entry Wire Line
	8650 5150 8750 5050
Text GLabel 7250 4350 0    60   Input ~ 0
~RESET
Entry Wire Line
	7900 1200 8000 1300
Entry Wire Line
	7900 1300 8000 1400
Entry Wire Line
	7900 1400 8000 1500
Entry Wire Line
	7900 1500 8000 1600
Entry Wire Line
	7900 1600 8000 1700
Entry Wire Line
	7900 1700 8000 1800
Entry Wire Line
	7900 1800 8000 1900
Entry Wire Line
	7900 1900 8000 2000
Entry Bus Bus
	7900 3400 8000 3300
Text GLabel 7500 2600 2    60   Input ~ 0
~WR
$Comp
L R-RESCUE-computer R8
U 1 1 58469F1E
P 3200 5700
F 0 "R8" V 3280 5700 50  0000 C CNN
F 1 "R" V 3200 5700 50  0000 C CNN
F 2 "10k" V 3100 5700 50  0000 C CNN
F 3 "" H 3200 5700 50  0000 C CNN
	1    3200 5700
	1    0    0    -1  
$EndComp
$Comp
L GND-RESCUE-computer #PWR20
U 1 1 58469F82
P 3200 5950
F 0 "#PWR20" H 3200 5700 50  0001 C CNN
F 1 "GND" H 3200 5800 50  0000 C CNN
F 2 "" H 3200 5950 50  0000 C CNN
F 3 "" H 3200 5950 50  0000 C CNN
	1    3200 5950
	1    0    0    -1  
$EndComp
Text GLabel 7500 2500 2    60   Input ~ 0
~MREQ
$Comp
L VCC #PWR18
U 1 1 5846D75F
P 2100 3650
F 0 "#PWR18" H 2100 3500 50  0001 C CNN
F 1 "VCC" H 2100 3800 50  0000 C CNN
F 2 "" H 2100 3650 50  0000 C CNN
F 3 "" H 2100 3650 50  0000 C CNN
	1    2100 3650
	1    0    0    -1  
$EndComp
$Comp
L MMBT3904 Q2
U 1 1 5846DAC6
P 8000 5550
F 0 "Q2" H 8200 5625 50  0000 L CNN
F 1 "2N3904" H 8200 5550 50  0000 L CNN
F 2 "SOT-23" H 8200 5475 50  0000 L CIN
F 3 "" H 8000 5550 50  0000 L CNN
	1    8000 5550
	1    0    0    -1  
$EndComp
$Comp
L GND-RESCUE-computer #PWR25
U 1 1 5846DB57
P 8100 5900
F 0 "#PWR25" H 8100 5650 50  0001 C CNN
F 1 "GND" H 8100 5750 50  0000 C CNN
F 2 "" H 8100 5900 50  0000 C CNN
F 3 "" H 8100 5900 50  0000 C CNN
	1    8100 5900
	1    0    0    -1  
$EndComp
$Comp
L R-RESCUE-computer R10
U 1 1 5846DCD8
P 7600 5550
F 0 "R10" V 7680 5550 50  0000 C CNN
F 1 "R" V 7600 5550 50  0000 C CNN
F 2 "1k" V 7500 5550 50  0000 C CNN
F 3 "" H 7600 5550 50  0000 C CNN
	1    7600 5550
	0    1    1    0   
$EndComp
Text GLabel 7350 5550 0    60   Input ~ 0
ENACTR
Text GLabel 7500 2400 2    60   Input ~ 0
ENACTR
Text GLabel 7500 2300 2    60   Input ~ 0
ENACPU
$Comp
L R-RESCUE-computer R9
U 1 1 58470377
P 4700 950
F 0 "R9" V 4780 950 50  0000 C CNN
F 1 "R" V 4700 950 50  0000 C CNN
F 2 "5k" V 4600 950 50  0000 C CNN
F 3 "" H 4700 950 50  0000 C CNN
	1    4700 950 
	-1   0    0    1   
$EndComp
NoConn ~ 5050 1500
Text GLabel 4850 1700 0    60   Input ~ 0
~CLK/2
$Comp
L VCC #PWR23
U 1 1 58470F33
P 6200 750
F 0 "#PWR23" H 6200 600 50  0001 C CNN
F 1 "VCC" H 6200 900 50  0000 C CNN
F 2 "" H 6200 750 50  0000 C CNN
F 3 "" H 6200 750 50  0000 C CNN
	1    6200 750 
	1    0    0    -1  
$EndComp
$Comp
L GND-RESCUE-computer #PWR24
U 1 1 58471098
P 6200 3050
F 0 "#PWR24" H 6200 2800 50  0001 C CNN
F 1 "GND" H 6200 2900 50  0000 C CNN
F 2 "" H 6200 3050 50  0000 C CNN
F 3 "" H 6200 3050 50  0000 C CNN
	1    6200 3050
	1    0    0    -1  
$EndComp
$Comp
L MMBT3904 Q1
U 1 1 58471542
P 2000 6900
F 0 "Q1" H 2200 6975 50  0000 L CNN
F 1 "2N3904" H 2200 6900 50  0000 L CNN
F 2 "SOT-23" H 2200 6825 50  0000 L CIN
F 3 "" H 2000 6900 50  0000 L CNN
	1    2000 6900
	1    0    0    -1  
$EndComp
$Comp
L GND-RESCUE-computer #PWR19
U 1 1 58471548
P 2100 7250
F 0 "#PWR19" H 2100 7000 50  0001 C CNN
F 1 "GND" H 2100 7100 50  0000 C CNN
F 2 "" H 2100 7250 50  0000 C CNN
F 3 "" H 2100 7250 50  0000 C CNN
	1    2100 7250
	1    0    0    -1  
$EndComp
$Comp
L R-RESCUE-computer R7
U 1 1 58471550
P 1600 6900
F 0 "R7" V 1680 6900 50  0000 C CNN
F 1 "R" V 1600 6900 50  0000 C CNN
F 2 "1k" V 1500 6900 50  0000 C CNN
F 3 "" H 1600 6900 50  0000 C CNN
	1    1600 6900
	0    1    1    0   
$EndComp
Text GLabel 1350 6900 0    60   Input ~ 0
ENACPU
$Comp
L CONN_02X03 P2
U 1 1 5847285C
P 8800 900
F 0 "P2" H 8800 1100 50  0000 C CNN
F 1 "CONN_02X03" H 8800 700 50  0000 C CNN
F 2 "" H 8800 -300 50  0000 C CNN
F 3 "" H 8800 -300 50  0000 C CNN
	1    8800 900 
	1    0    0    -1  
$EndComp
Text Label 9100 800  0    60   ~ 0
VCC
Text Label 9100 900  0    60   ~ 0
MOSI
Text Label 9100 1000 0    60   ~ 0
GND
Text Label 8300 800  0    60   ~ 0
MISO
Text Label 8300 900  0    60   ~ 0
SCK
Text Label 8300 1000 0    60   ~ 0
RST
$Comp
L GND-RESCUE-computer #PWR27
U 1 1 584743A8
P 9350 1200
F 0 "#PWR27" H 9350 950 50  0001 C CNN
F 1 "GND" H 9350 1050 50  0000 C CNN
F 2 "" H 9350 1200 50  0000 C CNN
F 3 "" H 9350 1200 50  0000 C CNN
	1    9350 1200
	1    0    0    -1  
$EndComp
$Comp
L VCC #PWR26
U 1 1 584745C4
P 9350 750
F 0 "#PWR26" H 9350 600 50  0001 C CNN
F 1 "VCC" H 9350 900 50  0000 C CNN
F 2 "" H 9350 750 50  0000 C CNN
F 3 "" H 9350 750 50  0000 C CNN
	1    9350 750 
	1    0    0    -1  
$EndComp
$Comp
L VCC #PWR22
U 1 1 58475267
P 4700 750
F 0 "#PWR22" H 4700 600 50  0001 C CNN
F 1 "VCC" H 4700 900 50  0000 C CNN
F 2 "" H 4700 750 50  0000 C CNN
F 3 "" H 4700 750 50  0000 C CNN
	1    4700 750 
	1    0    0    -1  
$EndComp
Text GLabel 4500 1200 0    60   Input ~ 0
~RESET
NoConn ~ 7350 2100
Text Notes 2200 2300 0    60   ~ 0
Clock selector
Wire Wire Line
	10500 5850 10700 5850
Wire Wire Line
	10700 5850 10700 5900
Wire Wire Line
	9800 3950 10000 3950
Wire Wire Line
	9900 4050 10000 4050
Wire Wire Line
	9900 4150 10000 4150
Wire Wire Line
	10000 4250 9900 4250
Wire Wire Line
	10000 4350 9900 4350
Wire Wire Line
	10000 4450 9900 4450
Wire Wire Line
	10000 4550 9900 4550
Wire Wire Line
	10000 4650 9900 4650
Wire Wire Line
	10000 4750 9900 4750
Wire Wire Line
	10000 4850 9900 4850
Wire Wire Line
	9800 3950 9800 3900
Wire Wire Line
	10500 4250 10600 4250
Wire Wire Line
	10500 4150 10600 4150
Wire Wire Line
	10500 4050 10600 4050
Wire Wire Line
	10500 3950 10600 3950
Wire Wire Line
	10500 4650 10600 4650
Wire Wire Line
	10500 4550 10600 4550
Wire Wire Line
	10500 4450 10600 4450
Wire Wire Line
	10500 4350 10600 4350
Wire Wire Line
	10500 5050 10600 5050
Wire Wire Line
	10500 4950 10600 4950
Wire Wire Line
	10500 4850 10600 4850
Wire Wire Line
	10500 4750 10600 4750
Wire Wire Line
	10500 5450 10600 5450
Wire Wire Line
	10500 5350 10600 5350
Wire Wire Line
	10500 5250 10600 5250
Wire Wire Line
	10500 5150 10600 5150
Wire Wire Line
	10000 4950 9900 4950
Wire Wire Line
	10000 5050 9900 5050
Wire Wire Line
	10000 5150 9900 5150
Wire Wire Line
	10000 5250 9900 5250
Wire Wire Line
	10000 5350 9900 5350
Wire Wire Line
	10000 5450 9900 5450
Wire Wire Line
	10000 5550 9900 5550
Wire Wire Line
	10000 5650 9900 5650
Wire Wire Line
	1250 1400 1250 1500
Wire Wire Line
	1600 1050 1700 1050
Wire Wire Line
	1600 950  1700 950 
Wire Wire Line
	1050 1950 1700 1950
Wire Wire Line
	1250 1800 1250 1950
Connection ~ 1250 1950
Wire Wire Line
	1550 1200 1550 2200
Wire Wire Line
	1550 2050 1700 2050
Wire Wire Line
	1550 1800 1700 1800
Connection ~ 1550 2050
Wire Wire Line
	1550 1700 1700 1700
Connection ~ 1550 1800
Wire Wire Line
	1550 1550 1700 1550
Connection ~ 1550 1700
Wire Wire Line
	1550 1450 1700 1450
Connection ~ 1550 1550
Wire Wire Line
	1550 1300 1700 1300
Connection ~ 1550 1450
Wire Wire Line
	1550 1200 1700 1200
Connection ~ 1550 1300
Wire Wire Line
	3350 1000 3200 1000
Wire Wire Line
	10600 5550 10500 5550
Wire Wire Line
	1300 4000 1450 4000
Wire Wire Line
	1300 4100 1450 4100
Wire Wire Line
	1300 4200 1450 4200
Wire Wire Line
	1300 4300 1450 4300
Wire Wire Line
	1300 4400 1450 4400
Wire Wire Line
	1300 4900 1450 4900
Wire Wire Line
	1300 6300 1450 6300
Wire Wire Line
	2750 5650 2950 5650
Wire Wire Line
	2750 5750 2950 5750
Wire Wire Line
	2750 5850 2950 5850
Wire Wire Line
	2750 5950 2950 5950
Wire Wire Line
	2750 6050 2950 6050
Wire Wire Line
	2750 6150 2950 6150
Wire Wire Line
	2750 6250 2950 6250
Wire Wire Line
	2750 6350 2950 6350
Wire Wire Line
	10500 5650 10650 5650
Wire Wire Line
	10500 5750 10650 5750
Wire Wire Line
	10000 5750 9900 5750
Wire Wire Line
	10000 5850 9900 5850
Wire Bus Line
	2850 3700 2850 5250
Wire Bus Line
	2950 3600 8650 3600
Wire Bus Line
	3600 3700 3600 5250
Wire Bus Line
	5450 3700 5450 5250
Wire Bus Line
	3050 3500 3050 6250
Wire Bus Line
	3150 3400 7900 3400
Wire Bus Line
	4800 3500 4800 4550
Wire Bus Line
	6650 3500 6650 4550
Wire Wire Line
	2750 5450 3400 5450
Wire Wire Line
	3400 5450 3400 6100
Wire Wire Line
	3400 6100 3500 6100
Wire Wire Line
	3500 5950 3450 5950
Wire Wire Line
	3450 5950 3450 6600
Wire Wire Line
	5200 5900 5200 5050
Wire Wire Line
	5200 5050 4700 5050
Wire Wire Line
	5200 6100 6900 6100
Wire Wire Line
	6900 6100 6900 5050
Wire Wire Line
	6900 5050 6550 5050
Wire Wire Line
	3350 6450 3500 6450
Wire Wire Line
	4900 4800 4700 4800
Wire Wire Line
	4900 4900 4700 4900
Wire Wire Line
	6750 4800 6550 4800
Wire Wire Line
	6750 4900 6550 4900
Wire Bus Line
	8750 3700 8750 5050
Wire Wire Line
	7250 4350 7350 4350
Wire Wire Line
	7350 1200 7900 1200
Wire Wire Line
	7350 1300 7900 1300
Wire Wire Line
	7350 1400 7900 1400
Wire Wire Line
	7350 1500 7900 1500
Wire Wire Line
	7350 1600 7900 1600
Wire Wire Line
	7350 1700 7900 1700
Wire Wire Line
	7350 1800 7900 1800
Wire Wire Line
	7350 1900 7900 1900
Wire Bus Line
	8000 1300 8000 3300
Wire Wire Line
	7350 2700 7350 4050
Wire Wire Line
	3200 5950 3200 5850
Wire Wire Line
	3200 5550 3200 5450
Connection ~ 3200 5450
Wire Wire Line
	7350 2600 7500 2600
Wire Wire Line
	7500 2500 7350 2500
Wire Wire Line
	2100 3650 2100 3750
Wire Wire Line
	8100 5750 8100 5900
Wire Wire Line
	8100 5350 8100 5200
Wire Wire Line
	7750 5550 7800 5550
Wire Wire Line
	7350 5550 7450 5550
Wire Wire Line
	7350 2300 7500 2300
Wire Wire Line
	7350 2400 7500 2400
Wire Wire Line
	4500 1200 5050 1200
Wire Wire Line
	4850 1700 5050 1700
Wire Wire Line
	6200 750  6200 900 
Wire Wire Line
	6200 3000 6200 3050
Wire Wire Line
	2100 7100 2100 7250
Wire Wire Line
	2100 6700 2100 6550
Wire Wire Line
	1750 6900 1800 6900
Wire Wire Line
	1350 6900 1450 6900
Wire Wire Line
	9050 800  9350 800 
Wire Wire Line
	9050 900  9450 900 
Wire Wire Line
	9050 1000 9350 1000
Wire Wire Line
	7500 800  8550 800 
Wire Wire Line
	7400 900  8550 900 
Wire Wire Line
	7200 1000 8550 1000
Wire Wire Line
	5000 1200 5000 850 
Wire Wire Line
	5000 850  7200 850 
Wire Wire Line
	7200 850  7200 1000
Connection ~ 5000 1200
Wire Wire Line
	7400 1900 7400 900 
Connection ~ 7400 1900
Wire Wire Line
	7500 1800 7500 800 
Connection ~ 7500 1800
Wire Wire Line
	9450 900  9450 1150
Wire Wire Line
	9450 1150 7600 1150
Wire Wire Line
	7600 1150 7600 1700
Connection ~ 7600 1700
Wire Wire Line
	9350 1000 9350 1200
Wire Wire Line
	4700 1100 4700 1200
Connection ~ 4700 1200
Wire Wire Line
	4700 750  4700 800 
Wire Wire Line
	9350 800  9350 750 
NoConn ~ 9900 5850
NoConn ~ 10650 5650
Wire Wire Line
	9900 4050 9900 3950
Connection ~ 9900 3950
Wire Wire Line
	10650 5750 10650 5850
Connection ~ 10650 5850
NoConn ~ 9900 5750
$Comp
L VCC #PWR15
U 1 1 58494917
P 850 4450
F 0 "#PWR15" H 850 4300 50  0001 C CNN
F 1 "VCC" H 850 4600 50  0000 C CNN
F 2 "" H 850 4450 50  0000 C CNN
F 3 "" H 850 4450 50  0000 C CNN
	1    850  4450
	1    0    0    -1  
$EndComp
Wire Wire Line
	1450 5100 850  5100
Wire Wire Line
	850  4450 850  5950
Wire Wire Line
	850  5350 1450 5350
Connection ~ 850  5100
Wire Wire Line
	850  5450 1450 5450
Connection ~ 850  5350
Wire Wire Line
	850  5950 1450 5950
Connection ~ 850  5450
$Comp
L CONN_02X12 P4
U 1 1 584A07C4
P 10350 2450
F 0 "P4" H 10350 3100 50  0000 C CNN
F 1 "CONN_02X12" V 10350 2450 50  0000 C CNN
F 2 "" H 10350 1250 50  0000 C CNN
F 3 "" H 10350 1250 50  0000 C CNN
	1    10350 2450
	1    0    0    -1  
$EndComp
$Comp
L VCC #PWR29
U 1 1 584A07CB
P 9900 1850
F 0 "#PWR29" H 9900 1700 50  0001 C CNN
F 1 "VCC" H 9900 2000 50  0000 C CNN
F 2 "" H 9900 1850 50  0000 C CNN
F 3 "" H 9900 1850 50  0000 C CNN
	1    9900 1850
	1    0    0    -1  
$EndComp
$Comp
L GND-RESCUE-computer #PWR31
U 1 1 584A07D1
P 10800 3050
F 0 "#PWR31" H 10800 2800 50  0001 C CNN
F 1 "GND" H 10800 2900 50  0000 C CNN
F 2 "" H 10800 3050 50  0000 C CNN
F 3 "" H 10800 3050 50  0000 C CNN
	1    10800 3050
	1    0    0    -1  
$EndComp
Text GLabel 10000 2100 0    60   Input ~ 0
D0
Text GLabel 10000 2200 0    60   Input ~ 0
D1
Text GLabel 10000 2300 0    60   Input ~ 0
D2
Text GLabel 10000 2400 0    60   Input ~ 0
D3
Text GLabel 10000 2500 0    60   Input ~ 0
D4
Text GLabel 10000 2600 0    60   Input ~ 0
D5
Text GLabel 10000 2700 0    60   Input ~ 0
D6
Text GLabel 10000 2800 0    60   Input ~ 0
D7
Text GLabel 10000 2900 0    60   Input ~ 0
~RESET
Text GLabel 10700 1900 2    60   Input ~ 0
A0
Text GLabel 10700 2000 2    60   Input ~ 0
A1
Text GLabel 10700 2100 2    60   Input ~ 0
A2
Text GLabel 10700 2200 2    60   Input ~ 0
A3
Text GLabel 10700 2300 2    60   Input ~ 0
~CLK/4
Text GLabel 10700 2400 2    60   Input ~ 0
~CLK/2
Text GLabel 10700 2500 2    60   Input ~ 0
~CLK
Text GLabel 10700 2600 2    60   Input ~ 0
~IORQ
Text GLabel 10700 2700 2    60   Input ~ 0
~RD
Text GLabel 10700 2800 2    60   Input ~ 0
~WR
Text Notes 10750 3450 2    60   ~ 0
CONNECTORS (x4)
Text GLabel 10000 3000 0    60   Input ~ 0
RESET
Wire Wire Line
	9900 1900 10100 1900
Wire Wire Line
	10000 2100 10100 2100
Wire Wire Line
	10100 2200 10000 2200
Wire Wire Line
	10100 2300 10000 2300
Wire Wire Line
	10100 2400 10000 2400
Wire Wire Line
	10100 2500 10000 2500
Wire Wire Line
	10100 2600 10000 2600
Wire Wire Line
	10100 2700 10000 2700
Wire Wire Line
	10100 2800 10000 2800
Wire Wire Line
	10100 2900 10000 2900
Wire Wire Line
	10600 2400 10700 2400
Wire Wire Line
	10600 2200 10700 2200
Wire Wire Line
	10600 2100 10700 2100
Wire Wire Line
	10600 2000 10700 2000
Wire Wire Line
	10600 2500 10700 2500
Wire Wire Line
	10600 2600 10700 2600
Wire Wire Line
	10600 2700 10700 2700
Wire Wire Line
	10600 2800 10700 2800
Wire Wire Line
	10600 2900 10700 2900
Wire Wire Line
	10600 3000 10800 3000
Wire Wire Line
	9900 1900 9900 1850
Wire Wire Line
	10800 3000 10800 3050
Wire Wire Line
	10600 1900 10700 1900
Wire Wire Line
	10600 2300 10700 2300
Wire Wire Line
	10100 3000 10000 3000
$Comp
L D_Small D3
U 1 1 584C80AC
P 1100 5700
F 0 "D3" H 1050 5780 50  0000 L CNN
F 1 "~" H 950 5620 50  0000 L CNN
F 2 "1N4148" H 1100 5600 50  0000 C CNN
F 3 "" V 1100 5700 50  0000 C CNN
	1    1100 5700
	-1   0    0    1   
$EndComp
Wire Wire Line
	800  5700 1000 5700
Wire Wire Line
	1200 5700 1450 5700
Wire Wire Line
	1350 5700 1350 3000
Wire Wire Line
	1350 3000 8100 3000
Wire Wire Line
	8100 3000 8100 2200
Wire Wire Line
	8100 2200 7350 2200
Connection ~ 1350 5700
NoConn ~ 10700 2900
NoConn ~ 10100 2000
$EndSCHEMATC
