EESchema Schematic File Version 2
LIBS:computer-rescue
LIBS:power
LIBS:device
LIBS:transistors
LIBS:conn
LIBS:linear
LIBS:regul
LIBS:74xx
LIBS:cmos4000
LIBS:adc-dac
LIBS:memory
LIBS:xilinx
LIBS:microcontrollers
LIBS:dsp
LIBS:microchip
LIBS:analog_switches
LIBS:motorola
LIBS:texas
LIBS:intel
LIBS:audio
LIBS:interface
LIBS:digital-audio
LIBS:philips
LIBS:display
LIBS:cypress
LIBS:siliconi
LIBS:opto
LIBS:atmel
LIBS:contrib
LIBS:valves
LIBS:vga
LIBS:computer-cache
EELAYER 25 0
EELAYER END
$Descr A4 11693 8268
encoding utf-8
Sheet 3 5
Title ""
Date "11 dec 2016"
Rev ""
Comp ""
Comment1 ""
Comment2 ""
Comment3 ""
Comment4 ""
$EndDescr
$Comp
L VGA J1
U 1 1 58488F09
P 9600 4950
F 0 "J1" H 9350 5750 60  0000 C CNN
F 1 "VGA" H 9600 4200 60  0000 C CNN
F 2 "" H 9600 4950 60  0001 C CNN
F 3 "" H 9600 4950 60  0001 C CNN
	1    9600 4950
	1    0    0    -1  
$EndComp
$Comp
L 28C256-RESCUE-computer U12
U 1 1 5848900A
P 5300 6000
F 0 "U12" H 5500 7000 50  0000 C CNN
F 1 "28C256" H 5600 5000 50  0000 C CNN
F 2 "" H 5300 6000 50  0000 C CNN
F 3 "" H 5300 6000 50  0000 C CNN
	1    5300 6000
	1    0    0    -1  
$EndComp
$Comp
L 74LS165 U13
U 1 1 5848906A
P 7050 5600
F 0 "U13" H 7200 5550 50  0000 C CNN
F 1 "74HC165" H 7200 5350 50  0000 C CNN
F 2 "" H 7050 5600 50  0000 C CNN
F 3 "" H 7050 5600 50  0000 C CNN
	1    7050 5600
	1    0    0    -1  
$EndComp
$Comp
L VCC #PWR41
U 1 1 58489129
P 8700 4300
F 0 "#PWR41" H 8700 4150 50  0001 C CNN
F 1 "VCC" H 8700 4450 50  0000 C CNN
F 2 "" H 8700 4300 50  0000 C CNN
F 3 "" H 8700 4300 50  0000 C CNN
	1    8700 4300
	1    0    0    -1  
$EndComp
NoConn ~ 9000 4700
NoConn ~ 10200 5300
NoConn ~ 10200 5100
NoConn ~ 10200 4500
$Comp
L R-RESCUE-computer R11
U 1 1 584892D5
P 8100 5100
F 0 "R11" V 8180 5100 50  0000 C CNN
F 1 "R" V 8100 5100 50  0000 C CNN
F 2 "1k" V 8000 5100 50  0000 C CNN
F 3 "" H 8100 5100 50  0000 C CNN
	1    8100 5100
	0    -1   -1   0   
$EndComp
$Comp
L VCC #PWR36
U 1 1 5848AD34
P 4500 6700
F 0 "#PWR36" H 4500 6550 50  0001 C CNN
F 1 "VCC" H 4500 6850 50  0000 C CNN
F 2 "" H 4500 6700 50  0000 C CNN
F 3 "" H 4500 6700 50  0000 C CNN
	1    4500 6700
	1    0    0    -1  
$EndComp
$Comp
L ATMEGA328-P-RESCUE-computer IC3
U 1 1 5848B328
P 1850 6150
F 0 "IC3" H 1100 7400 50  0000 L BNN
F 1 "ATMEGA328-P" H 2250 4750 50  0000 L BNN
F 2 "DIL28" H 1850 6150 50  0000 C CIN
F 3 "" H 1850 6150 50  0000 C CNN
	1    1850 6150
	1    0    0    -1  
$EndComp
$Comp
L GND-RESCUE-computer #PWR35
U 1 1 5848BE50
P 4350 6600
F 0 "#PWR35" H 4350 6350 50  0001 C CNN
F 1 "GND" H 4350 6450 50  0000 C CNN
F 2 "" H 4350 6600 50  0000 C CNN
F 3 "" H 4350 6600 50  0000 C CNN
	1    4350 6600
	1    0    0    -1  
$EndComp
$Comp
L GND-RESCUE-computer #PWR38
U 1 1 5848BFE3
P 5900 6000
F 0 "#PWR38" H 5900 5750 50  0001 C CNN
F 1 "GND" H 5900 5850 50  0000 C CNN
F 2 "" H 5900 6000 50  0000 C CNN
F 3 "" H 5900 6000 50  0000 C CNN
	1    5900 6000
	1    0    0    -1  
$EndComp
Text GLabel 6300 6100 0    60   Input ~ 0
~CLK
NoConn ~ 7750 5200
Text GLabel 4100 5250 2    60   Input ~ 0
HSYNC
Text GLabel 4100 5350 2    60   Input ~ 0
VSYNC
Text GLabel 10450 4900 2    60   Input ~ 0
HSYNC
Text GLabel 10450 4700 2    60   Input ~ 0
VSYNC
$Comp
L ATMEGA8-P IC2
U 1 1 5848F95E
P 1850 3000
F 0 "IC2" H 1100 4300 50  0000 L BNN
F 1 "ATMEGA8-P" H 2350 1550 50  0000 L BNN
F 2 "DIL28" H 1850 3000 50  0000 C CIN
F 3 "" H 1850 3000 50  0000 C CNN
	1    1850 3000
	1    0    0    -1  
$EndComp
Text Label 3050 5050 0    60   ~ 0
VMCLK
Text Label 3050 5150 0    60   ~ 0
VMENA
Text GLabel 1600 850  0    60   Input ~ 0
A0
Text GLabel 1600 1050 0    60   Input ~ 0
A1
Text GLabel 2800 1150 0    60   Input ~ 0
A2
Text GLabel 4050 1250 0    60   Input ~ 0
A3
Text GLabel 3100 1900 2    60   Input ~ 0
D0
Text GLabel 3100 2000 2    60   Input ~ 0
D1
Text GLabel 3100 2100 2    60   Input ~ 0
D2
Text GLabel 3100 2200 2    60   Input ~ 0
D3
Text GLabel 3100 2300 2    60   Input ~ 0
D4
Text GLabel 3100 2400 2    60   Input ~ 0
D5
Text GLabel 3100 2600 2    60   Input ~ 0
D6
Text GLabel 3100 2700 2    60   Input ~ 0
D7
Text Notes 600  750  0    60   ~ 0
Video: 80x25\nChar: 8x17
$Comp
L 74LS32 U11
U 1 1 58495A38
P 2350 950
F 0 "U11" H 2350 1000 50  0000 C CNN
F 1 "74HC32" H 2350 900 50  0000 C CNN
F 2 "" H 2350 950 50  0000 C CNN
F 3 "" H 2350 950 50  0000 C CNN
	1    2350 950 
	1    0    0    -1  
$EndComp
$Comp
L 74LS32 U11
U 2 1 58495DD5
P 3550 1050
F 0 "U11" H 3550 1100 50  0000 C CNN
F 1 "74HC32" H 3550 1000 50  0000 C CNN
F 2 "" H 3550 1050 50  0000 C CNN
F 3 "" H 3550 1050 50  0000 C CNN
	2    3550 1050
	1    0    0    -1  
$EndComp
$Comp
L 74LS32 U11
U 3 1 58495E39
P 4750 1150
F 0 "U11" H 4750 1200 50  0000 C CNN
F 1 "74HC32" H 4750 1100 50  0000 C CNN
F 2 "" H 4750 1150 50  0000 C CNN
F 3 "" H 4750 1150 50  0000 C CNN
	3    4750 1150
	1    0    0    -1  
$EndComp
$Comp
L VCC #PWR34
U 1 1 584979A4
P 1850 1500
F 0 "#PWR34" H 1850 1350 50  0001 C CNN
F 1 "VCC" H 1850 1650 50  0000 C CNN
F 2 "" H 1850 1500 50  0000 C CNN
F 3 "" H 1850 1500 50  0000 C CNN
	1    1850 1500
	1    0    0    -1  
$EndComp
$Comp
L SPST SW3
U 1 1 58498AD9
P 3950 7350
F 0 "SW3" H 3950 7450 50  0000 C CNN
F 1 "SPST" H 3950 7250 50  0000 C CNN
F 2 "TEST" H 3950 7550 50  0000 C CNN
F 3 "" H 3950 7350 50  0000 C CNN
	1    3950 7350
	1    0    0    -1  
$EndComp
$Comp
L GND-RESCUE-computer #PWR37
U 1 1 58498BAF
P 4600 7450
F 0 "#PWR37" H 4600 7200 50  0001 C CNN
F 1 "GND" H 4600 7300 50  0000 C CNN
F 2 "" H 4600 7450 50  0000 C CNN
F 3 "" H 4600 7450 50  0000 C CNN
	1    4600 7450
	1    0    0    -1  
$EndComp
$Comp
L CONN_02X12 P6
U 1 1 584A08ED
P 10200 1550
F 0 "P6" H 10200 2200 50  0000 C CNN
F 1 "CONN_02X12" V 10200 1550 50  0000 C CNN
F 2 "" H 10200 350 50  0000 C CNN
F 3 "" H 10200 350 50  0000 C CNN
	1    10200 1550
	1    0    0    -1  
$EndComp
$Comp
L VCC #PWR42
U 1 1 584A08F4
P 9750 950
F 0 "#PWR42" H 9750 800 50  0001 C CNN
F 1 "VCC" H 9750 1100 50  0000 C CNN
F 2 "" H 9750 950 50  0000 C CNN
F 3 "" H 9750 950 50  0000 C CNN
	1    9750 950 
	1    0    0    -1  
$EndComp
$Comp
L GND-RESCUE-computer #PWR43
U 1 1 584A08FA
P 10650 2150
F 0 "#PWR43" H 10650 1900 50  0001 C CNN
F 1 "GND" H 10650 2000 50  0000 C CNN
F 2 "" H 10650 2150 50  0000 C CNN
F 3 "" H 10650 2150 50  0000 C CNN
	1    10650 2150
	1    0    0    -1  
$EndComp
Text GLabel 9850 1200 0    60   Input ~ 0
D0
Text GLabel 9850 1300 0    60   Input ~ 0
D1
Text GLabel 9850 1400 0    60   Input ~ 0
D2
Text GLabel 9850 1500 0    60   Input ~ 0
D3
Text GLabel 9850 1600 0    60   Input ~ 0
D4
Text GLabel 9850 1700 0    60   Input ~ 0
D5
Text GLabel 9850 1800 0    60   Input ~ 0
D6
Text GLabel 9850 1900 0    60   Input ~ 0
D7
Text GLabel 9850 2000 0    60   Input ~ 0
~RESET
Text GLabel 10550 1000 2    60   Input ~ 0
A0
Text GLabel 10550 1100 2    60   Input ~ 0
A1
Text GLabel 10550 1200 2    60   Input ~ 0
A2
Text GLabel 10550 1300 2    60   Input ~ 0
A3
Text GLabel 10550 1400 2    60   Input ~ 0
~CLK/4
Text GLabel 10550 1500 2    60   Input ~ 0
~CLK/2
Text GLabel 10550 1600 2    60   Input ~ 0
~CLK
Text GLabel 10550 1700 2    60   Input ~ 0
~IORQ
Text GLabel 10550 1800 2    60   Input ~ 0
~RD
Text GLabel 10550 1900 2    60   Input ~ 0
~WR
Text Notes 10600 2550 2    60   ~ 0
CONNECTORS (x4)
Text GLabel 9850 2100 0    60   Input ~ 0
RESET
$Comp
L 74LS32 U11
U 4 1 584A145E
P 5950 1250
F 0 "U11" H 5950 1300 50  0000 C CNN
F 1 "74HC32" H 5950 1200 50  0000 C CNN
F 2 "" H 5950 1250 50  0000 C CNN
F 3 "" H 5950 1250 50  0000 C CNN
	4    5950 1250
	1    0    0    -1  
$EndComp
$Comp
L 74LS32 U14
U 1 1 584A14C4
P 7150 1350
F 0 "U14" H 7150 1400 50  0000 C CNN
F 1 "74HC32" H 7150 1300 50  0000 C CNN
F 2 "" H 7150 1350 50  0000 C CNN
F 3 "" H 7150 1350 50  0000 C CNN
	1    7150 1350
	1    0    0    -1  
$EndComp
Text GLabel 5350 1350 0    60   Input ~ 0
~IORQ
Text GLabel 6550 1450 0    60   Input ~ 0
~WR
Text Notes 7600 1800 2    60   ~ 0
Option: use the empty uC pin\nto free one IC, or use a transistor gate.
$Comp
L 74HC14 U2
U 6 1 584A3D58
P 5150 3500
F 0 "U2" H 5300 3600 50  0000 C CNN
F 1 "74HC14" H 5350 3400 50  0000 C CNN
F 2 "" H 5150 3500 50  0000 C CNN
F 3 "" H 5150 3500 50  0000 C CNN
	6    5150 3500
	-1   0    0    1   
$EndComp
Text Notes 5650 3750 2    60   ~ 0
(or use a transistor gate?)
Text GLabel 850  2600 0    60   Input ~ 0
~CLK/2
NoConn ~ 950  2800
NoConn ~ 950  2100
NoConn ~ 950  2200
NoConn ~ 950  2300
$Comp
L VCC #PWR32
U 1 1 584AB563
P 950 4900
F 0 "#PWR32" H 950 4750 50  0001 C CNN
F 1 "VCC" H 950 5050 50  0000 C CNN
F 2 "" H 950 4900 50  0000 C CNN
F 3 "" H 950 4900 50  0000 C CNN
	1    950  4900
	1    0    0    -1  
$EndComp
NoConn ~ 950  5350
NoConn ~ 950  5650
$Comp
L GND-RESCUE-computer #PWR33
U 1 1 584AB87D
P 950 7450
F 0 "#PWR33" H 950 7200 50  0001 C CNN
F 1 "GND" H 950 7300 50  0000 C CNN
F 2 "" H 950 7450 50  0000 C CNN
F 3 "" H 950 7450 50  0000 C CNN
	1    950  7450
	1    0    0    -1  
$EndComp
Text GLabel 3000 5650 2    60   Input ~ 0
~CLK
Entry Wire Line
	2850 6650 2950 6750
Entry Wire Line
	2850 6750 2950 6850
Entry Wire Line
	2850 6850 2950 6950
Entry Wire Line
	2850 6950 2950 7050
Entry Wire Line
	2850 7050 2950 7150
Entry Wire Line
	2850 7150 2950 7250
Entry Wire Line
	2850 7250 2950 7350
Entry Wire Line
	2850 7350 2950 7450
Entry Wire Line
	4500 5000 4600 5100
Entry Wire Line
	4500 5100 4600 5200
Entry Wire Line
	4500 5200 4600 5300
Entry Wire Line
	4500 5300 4600 5400
Entry Wire Line
	4500 5400 4600 5500
Entry Wire Line
	4500 5500 4600 5600
Entry Wire Line
	4500 5600 4600 5700
Entry Wire Line
	4500 5700 4600 5800
Entry Wire Line
	2850 4000 2950 4100
Entry Wire Line
	2850 3900 2950 4000
Entry Wire Line
	2850 3800 2950 3900
Entry Wire Line
	2850 3700 2950 3800
Entry Wire Line
	2850 3600 2950 3700
Entry Wire Line
	2850 3400 2950 3500
Entry Wire Line
	2850 3300 2950 3400
Entry Wire Line
	2850 3100 2950 3200
$Comp
L CONN_02X03 P5
U 1 1 584B082C
P 6300 2450
F 0 "P5" H 6300 2650 50  0000 C CNN
F 1 "CONN_02X03" H 6300 2250 50  0000 C CNN
F 2 "" H 6300 1250 50  0000 C CNN
F 3 "" H 6300 1250 50  0000 C CNN
	1    6300 2450
	1    0    0    -1  
$EndComp
Text Label 6600 2350 0    60   ~ 0
VCC
Text Label 6600 2450 0    60   ~ 0
MOSI
Text Label 6600 2550 0    60   ~ 0
GND
Text Label 5800 2350 0    60   ~ 0
MISO
Text Label 5800 2450 0    60   ~ 0
SCK
Text Label 5800 2550 0    60   ~ 0
RST
$Comp
L GND-RESCUE-computer #PWR40
U 1 1 584B0839
P 6850 2750
F 0 "#PWR40" H 6850 2500 50  0001 C CNN
F 1 "GND" H 6850 2600 50  0000 C CNN
F 2 "" H 6850 2750 50  0000 C CNN
F 3 "" H 6850 2750 50  0000 C CNN
	1    6850 2750
	1    0    0    -1  
$EndComp
$Comp
L VCC #PWR39
U 1 1 584B083F
P 6850 2300
F 0 "#PWR39" H 6850 2150 50  0001 C CNN
F 1 "VCC" H 6850 2450 50  0000 C CNN
F 2 "" H 6850 2300 50  0000 C CNN
F 3 "" H 6850 2300 50  0000 C CNN
	1    6850 2300
	1    0    0    -1  
$EndComp
Text GLabel 850  1900 0    60   Input ~ 0
~RESET
Wire Wire Line
	10450 4900 10200 4900
Wire Wire Line
	10450 4700 10200 4700
Connection ~ 6200 5950
Wire Wire Line
	6200 5000 6350 5000
Wire Wire Line
	6200 5950 6200 5000
Wire Wire Line
	8450 5300 9000 5300
Wire Wire Line
	8450 4900 8450 5300
Wire Wire Line
	7950 5100 7750 5100
Wire Wire Line
	2850 5350 4100 5350
Wire Wire Line
	2850 5250 4100 5250
Wire Wire Line
	6300 6100 6350 6100
Connection ~ 4200 6800
Wire Wire Line
	6350 7100 6350 6200
Wire Wire Line
	4200 7100 6350 7100
Wire Wire Line
	5900 5950 6350 5950
Wire Wire Line
	5900 6000 5900 5950
Connection ~ 4550 6800
Wire Wire Line
	4200 5450 4200 7100
Wire Wire Line
	4550 6900 4600 6900
Wire Wire Line
	4550 6800 4550 6900
Wire Wire Line
	4200 6800 4600 6800
Connection ~ 4350 6500
Wire Wire Line
	4350 6500 4600 6500
Connection ~ 4350 6400
Wire Wire Line
	4600 6400 4350 6400
Wire Wire Line
	4350 6300 4350 6600
Wire Wire Line
	4600 6300 4350 6300
Wire Wire Line
	6000 5800 6350 5800
Wire Wire Line
	6000 5700 6350 5700
Wire Wire Line
	6000 5600 6350 5600
Wire Wire Line
	6000 5500 6350 5500
Wire Wire Line
	6000 5400 6350 5400
Wire Wire Line
	6000 5300 6350 5300
Wire Wire Line
	6000 5200 6350 5200
Wire Wire Line
	6000 5100 6350 5100
Wire Wire Line
	4500 6700 4600 6700
Connection ~ 8450 5100
Wire Wire Line
	8250 5100 9000 5100
Wire Wire Line
	9000 4900 8450 4900
Connection ~ 8850 4600
Wire Wire Line
	9000 4600 8850 4600
Wire Wire Line
	8700 4800 9000 4800
Wire Wire Line
	8700 4300 8700 4800
Connection ~ 8850 5000
Wire Wire Line
	8850 5000 9000 5000
Connection ~ 8850 5200
Wire Wire Line
	8850 5200 9000 5200
Wire Wire Line
	8850 5400 9000 5400
Wire Wire Line
	8850 4500 8850 5400
Wire Wire Line
	9000 4500 8850 4500
Wire Wire Line
	3100 1900 2850 1900
Wire Wire Line
	3100 2000 2850 2000
Wire Wire Line
	3100 2100 2850 2100
Wire Wire Line
	2850 2200 3100 2200
Wire Wire Line
	2850 2300 3100 2300
Wire Wire Line
	2850 2400 3100 2400
Wire Wire Line
	3100 2600 2850 2600
Wire Wire Line
	3100 2700 2850 2700
Wire Wire Line
	1600 850  1750 850 
Wire Wire Line
	1600 1050 1750 1050
Wire Wire Line
	2800 1150 2950 1150
Wire Wire Line
	4050 1250 4150 1250
Wire Wire Line
	1850 1500 1850 1600
Wire Wire Line
	4600 7450 4600 7350
Wire Wire Line
	4600 7350 4450 7350
Wire Wire Line
	9750 1000 9950 1000
Wire Wire Line
	9850 1200 9950 1200
Wire Wire Line
	9950 1300 9850 1300
Wire Wire Line
	9950 1400 9850 1400
Wire Wire Line
	9950 1500 9850 1500
Wire Wire Line
	9950 1600 9850 1600
Wire Wire Line
	9950 1700 9850 1700
Wire Wire Line
	9950 1800 9850 1800
Wire Wire Line
	9950 1900 9850 1900
Wire Wire Line
	9950 2000 9850 2000
Wire Wire Line
	10450 1500 10550 1500
Wire Wire Line
	10450 1300 10550 1300
Wire Wire Line
	10450 1200 10550 1200
Wire Wire Line
	10450 1100 10550 1100
Wire Wire Line
	10450 1600 10550 1600
Wire Wire Line
	10450 1700 10550 1700
Wire Wire Line
	10450 1800 10550 1800
Wire Wire Line
	10450 1900 10550 1900
Wire Wire Line
	10450 2000 10550 2000
Wire Wire Line
	10450 2100 10650 2100
Wire Wire Line
	9750 1000 9750 950 
Wire Wire Line
	10650 2100 10650 2150
Wire Wire Line
	10450 1000 10550 1000
Wire Wire Line
	10450 1400 10550 1400
Wire Wire Line
	9950 2100 9850 2100
Wire Wire Line
	2850 3500 4700 3500
Wire Wire Line
	850  2600 950  2600
Wire Wire Line
	950  4900 950  5050
Wire Wire Line
	950  7250 950  7450
Connection ~ 950  7350
Wire Wire Line
	3000 5650 2850 5650
Wire Wire Line
	3450 2900 3450 5050
Wire Wire Line
	3450 5050 2850 5050
Wire Wire Line
	3550 2800 3550 5150
Wire Wire Line
	3550 5150 2850 5150
Wire Wire Line
	2850 5450 4200 5450
Wire Bus Line
	2950 3200 2950 7450
Wire Bus Line
	4500 5700 2950 5700
Wire Bus Line
	4500 5000 4500 5700
Wire Wire Line
	2850 5750 3450 5750
Wire Wire Line
	2850 5900 4600 5900
Wire Wire Line
	2850 6000 4600 6000
Wire Wire Line
	2850 6100 4600 6100
Wire Wire Line
	2850 6200 4600 6200
Wire Wire Line
	3550 2800 2850 2800
Wire Wire Line
	3450 2900 2850 2900
Wire Wire Line
	7750 1350 7750 3500
Wire Wire Line
	6550 2350 6850 2350
Wire Wire Line
	6550 2450 6950 2450
Wire Wire Line
	6550 2550 6850 2550
Wire Wire Line
	5550 2350 6050 2350
Wire Wire Line
	3050 2450 6050 2450
Wire Wire Line
	5450 2550 6050 2550
Wire Wire Line
	6950 2450 6950 2700
Wire Wire Line
	6850 2550 6850 2750
Wire Wire Line
	6850 2350 6850 2300
Wire Wire Line
	3050 2400 3050 2450
Connection ~ 3050 2400
Wire Wire Line
	3050 2300 3050 1700
Wire Wire Line
	3050 1700 5550 1700
Wire Wire Line
	5550 1700 5550 2350
Connection ~ 3050 2300
Wire Wire Line
	7750 3500 5600 3500
Wire Wire Line
	5450 1500 5450 2550
Wire Wire Line
	900  1500 5450 1500
Wire Wire Line
	900  1500 900  1900
Wire Wire Line
	850  1900 950  1900
Connection ~ 900  1900
Wire Wire Line
	2950 2200 2950 1600
Wire Wire Line
	2950 1600 5650 1600
Wire Wire Line
	5650 1600 5650 2700
Connection ~ 2950 2200
Wire Wire Line
	5650 2700 6950 2700
Wire Wire Line
	2850 5550 3750 5550
Wire Wire Line
	3750 5550 3750 2450
Connection ~ 3750 2450
Wire Wire Line
	3950 5350 3950 1600
Connection ~ 3950 1600
Connection ~ 3950 5350
Wire Wire Line
	3850 5450 3850 1700
Connection ~ 3850 1700
Connection ~ 3850 5450
Wire Wire Line
	2850 6500 4050 6500
Wire Wire Line
	4050 6500 4050 1500
Connection ~ 4050 1500
Wire Wire Line
	3450 5750 3450 7350
NoConn ~ 10550 2000
NoConn ~ 9950 1100
$EndSCHEMATC
