EESchema Schematic File Version 2
LIBS:computer-rescue
LIBS:power
LIBS:device
LIBS:transistors
LIBS:conn
LIBS:linear
LIBS:regul
LIBS:74xx
LIBS:cmos4000
LIBS:adc-dac
LIBS:memory
LIBS:xilinx
LIBS:microcontrollers
LIBS:dsp
LIBS:microchip
LIBS:analog_switches
LIBS:motorola
LIBS:texas
LIBS:intel
LIBS:audio
LIBS:interface
LIBS:digital-audio
LIBS:philips
LIBS:display
LIBS:cypress
LIBS:siliconi
LIBS:opto
LIBS:atmel
LIBS:contrib
LIBS:valves
LIBS:vga
LIBS:computer-cache
EELAYER 25 0
EELAYER END
$Descr A4 11693 8268
encoding utf-8
Sheet 4 5
Title ""
Date "11 dec 2016"
Rev ""
Comp ""
Comment1 ""
Comment2 ""
Comment3 ""
Comment4 ""
$EndDescr
$Comp
L CONN_02X12 P9
U 1 1 584A09D9
P 10050 1650
F 0 "P9" H 10050 2300 50  0000 C CNN
F 1 "CONN_02X12" V 10050 1650 50  0000 C CNN
F 2 "" H 10050 450 50  0000 C CNN
F 3 "" H 10050 450 50  0000 C CNN
	1    10050 1650
	1    0    0    -1  
$EndComp
$Comp
L VCC #PWR55
U 1 1 584A09E0
P 9600 1050
F 0 "#PWR55" H 9600 900 50  0001 C CNN
F 1 "VCC" H 9600 1200 50  0000 C CNN
F 2 "" H 9600 1050 50  0000 C CNN
F 3 "" H 9600 1050 50  0000 C CNN
	1    9600 1050
	1    0    0    -1  
$EndComp
$Comp
L GND-RESCUE-computer #PWR58
U 1 1 584A09E6
P 10500 2250
F 0 "#PWR58" H 10500 2000 50  0001 C CNN
F 1 "GND" H 10500 2100 50  0000 C CNN
F 2 "" H 10500 2250 50  0000 C CNN
F 3 "" H 10500 2250 50  0000 C CNN
	1    10500 2250
	1    0    0    -1  
$EndComp
Text GLabel 9700 1300 0    60   Input ~ 0
D0
Text GLabel 9700 1400 0    60   Input ~ 0
D1
Text GLabel 9700 1500 0    60   Input ~ 0
D2
Text GLabel 9700 1600 0    60   Input ~ 0
D3
Text GLabel 9700 1700 0    60   Input ~ 0
D4
Text GLabel 9700 1800 0    60   Input ~ 0
D5
Text GLabel 9700 1900 0    60   Input ~ 0
D6
Text GLabel 9700 2000 0    60   Input ~ 0
D7
Text GLabel 9700 2100 0    60   Input ~ 0
~RESET
Text GLabel 10400 1100 2    60   Input ~ 0
A0
Text GLabel 10400 1200 2    60   Input ~ 0
A1
Text GLabel 10400 1300 2    60   Input ~ 0
A2
Text GLabel 10400 1400 2    60   Input ~ 0
A3
Text GLabel 10400 1500 2    60   Input ~ 0
~CLK/4
Text GLabel 10400 1600 2    60   Input ~ 0
~CLK/2
Text GLabel 10400 1700 2    60   Input ~ 0
~CLK
Text GLabel 10400 1800 2    60   Input ~ 0
~IORQ
Text GLabel 10400 1900 2    60   Input ~ 0
~RD
Text GLabel 10400 2000 2    60   Input ~ 0
~WR
Text Notes 10450 2650 2    60   ~ 0
CONNECTORS (x4)
Text GLabel 9700 2200 0    60   Input ~ 0
RESET
$Comp
L SD_Card CON2
U 1 1 584A0AAB
P 7150 5100
F 0 "CON2" H 6500 5650 50  0000 C CNN
F 1 "SD_Card" H 7750 4550 50  0000 C CNN
F 2 "10067847-001" H 7350 5450 50  0000 C CNN
F 3 "" H 7150 5100 50  0000 C CNN
	1    7150 5100
	1    0    0    -1  
$EndComp
$Comp
L 4050 U17
U 1 1 584A0B1B
P 5200 4800
F 0 "U17" H 5395 4915 50  0000 C CNN
F 1 "4010" H 5390 4675 50  0000 C CNN
F 2 "" H 5200 4800 60  0001 C CNN
F 3 "" H 5200 4800 60  0001 C CNN
	1    5200 4800
	1    0    0    -1  
$EndComp
$Comp
L USB_A P8
U 1 1 584A0C51
P 6000 7150
F 0 "P8" H 6200 6950 50  0000 C CNN
F 1 "USB_A" H 5950 7350 50  0000 C CNN
F 2 "" V 5950 7050 50  0000 C CNN
F 3 "" V 5950 7050 50  0000 C CNN
	1    6000 7150
	0    1    1    0   
$EndComp
$Comp
L ATMEGA8-P IC4
U 1 1 584A0CC5
P 2700 5700
F 0 "IC4" H 1950 7000 50  0000 L BNN
F 1 "ATMEGA8-P" H 3200 4250 50  0000 L BNN
F 2 "DIL28" H 2700 5700 50  0000 C CIN
F 3 "" H 2700 5700 50  0000 C CNN
	1    2700 5700
	1    0    0    -1  
$EndComp
$Comp
L SPEAKER SP1
U 1 1 584A0D3E
P 3700 3900
F 0 "SP1" H 3600 4150 50  0000 C CNN
F 1 "PIEZO" H 3600 3650 50  0000 C CNN
F 2 "" H 3700 3900 50  0000 C CNN
F 3 "" H 3700 3900 50  0000 C CNN
	1    3700 3900
	0    1    -1   0   
$EndComp
Text Notes 5700 4600 2    60   ~ 0
(option: use 2x4049)
$Comp
L 4050 U17
U 2 1 584B2AA6
P 5200 5150
F 0 "U17" H 5395 5265 50  0000 C CNN
F 1 "4010" H 5390 5025 50  0000 C CNN
F 2 "" H 5200 5150 60  0001 C CNN
F 3 "" H 5200 5150 60  0001 C CNN
	2    5200 5150
	1    0    0    -1  
$EndComp
$Comp
L 4050 U17
U 3 1 584B2ADD
P 5200 5500
F 0 "U17" H 5395 5615 50  0000 C CNN
F 1 "4010" H 5390 5375 50  0000 C CNN
F 2 "" H 5200 5500 60  0001 C CNN
F 3 "" H 5200 5500 60  0001 C CNN
	3    5200 5500
	1    0    0    -1  
$EndComp
$Comp
L +3.3V-RESCUE-computer #PWR50
U 1 1 584B32B8
P 6050 4000
F 0 "#PWR50" H 6050 3850 50  0001 C CNN
F 1 "+3.3V" H 6050 4140 50  0000 C CNN
F 2 "" H 6050 4000 50  0000 C CNN
F 3 "" H 6050 4000 50  0000 C CNN
	1    6050 4000
	1    0    0    -1  
$EndComp
Wire Wire Line
	9600 1100 9800 1100
Wire Wire Line
	9700 1300 9800 1300
Wire Wire Line
	9800 1400 9700 1400
Wire Wire Line
	9800 1500 9700 1500
Wire Wire Line
	9800 1600 9700 1600
Wire Wire Line
	9800 1700 9700 1700
Wire Wire Line
	9800 1800 9700 1800
Wire Wire Line
	9800 1900 9700 1900
Wire Wire Line
	9800 2000 9700 2000
Wire Wire Line
	9800 2100 9700 2100
Wire Wire Line
	10300 1600 10400 1600
Wire Wire Line
	10300 1400 10400 1400
Wire Wire Line
	10300 1300 10400 1300
Wire Wire Line
	10300 1200 10400 1200
Wire Wire Line
	10300 1700 10400 1700
Wire Wire Line
	10300 1800 10400 1800
Wire Wire Line
	10300 1900 10400 1900
Wire Wire Line
	10300 2000 10400 2000
Wire Wire Line
	10300 2100 10400 2100
Wire Wire Line
	10300 2200 10500 2200
Wire Wire Line
	9600 1100 9600 1050
Wire Wire Line
	10500 2200 10500 2250
Wire Wire Line
	10300 1100 10400 1100
Wire Wire Line
	10300 1500 10400 1500
Wire Wire Line
	9800 2200 9700 2200
Wire Wire Line
	5650 4800 6250 4800
Wire Wire Line
	6250 5200 5750 5200
Wire Wire Line
	5750 5200 5750 5500
Wire Wire Line
	5750 5500 5650 5500
Wire Wire Line
	4550 5750 5850 5750
Wire Wire Line
	5850 5750 5850 5400
Wire Wire Line
	5850 5400 6250 5400
Wire Wire Line
	5650 4900 6250 4900
Wire Wire Line
	5650 5150 5650 4900
Wire Wire Line
	6250 5000 6150 5000
Wire Wire Line
	6150 5000 6150 5950
Wire Wire Line
	6150 5300 6250 5300
$Comp
L GND-RESCUE-computer #PWR53
U 1 1 584B33A3
P 6150 5950
F 0 "#PWR53" H 6150 5700 50  0001 C CNN
F 1 "GND" H 6150 5800 50  0000 C CNN
F 2 "" H 6150 5950 50  0000 C CNN
F 3 "" H 6150 5950 50  0000 C CNN
	1    6150 5950
	1    0    0    -1  
$EndComp
Connection ~ 6150 5300
Wire Wire Line
	6050 4000 6050 5100
Wire Wire Line
	6050 5100 6250 5100
$Comp
L R-RESCUE-computer R15
U 1 1 584B35AF
P 5950 4350
F 0 "R15" V 6030 4350 50  0000 C CNN
F 1 "R" V 5950 4350 50  0000 C CNN
F 2 "50k" V 5850 4350 50  0000 C CNN
F 3 "" H 5950 4350 50  0000 C CNN
	1    5950 4350
	1    0    0    -1  
$EndComp
Wire Wire Line
	5950 4500 5950 5500
Wire Wire Line
	5950 5500 6250 5500
Wire Wire Line
	6250 4700 5950 4700
Connection ~ 5950 4700
Wire Wire Line
	5950 4200 5950 4050
Wire Wire Line
	5950 4050 6050 4050
Connection ~ 6050 4050
Wire Wire Line
	3700 4800 4750 4800
Wire Wire Line
	4750 5150 4750 4900
Wire Wire Line
	4750 4900 3700 4900
Wire Wire Line
	4750 5500 4650 5500
Wire Wire Line
	4650 5500 4650 5100
Wire Wire Line
	4650 5100 3700 5100
Wire Wire Line
	3700 5000 4550 5000
Wire Wire Line
	4550 5000 4550 5750
Text Notes 5950 5950 2    60   ~ 0
(TODO: needs level conversion?)\nuse transistor?
$Comp
L GND-RESCUE-computer #PWR49
U 1 1 584B4E44
P 5550 7350
F 0 "#PWR49" H 5550 7100 50  0001 C CNN
F 1 "GND" H 5550 7200 50  0000 C CNN
F 2 "" H 5550 7350 50  0000 C CNN
F 3 "" H 5550 7350 50  0000 C CNN
	1    5550 7350
	1    0    0    -1  
$EndComp
Wire Wire Line
	5550 7350 5550 7250
Wire Wire Line
	5550 7250 5700 7250
$Comp
L R-RESCUE-computer R12
U 1 1 584B4EE8
P 4000 6200
F 0 "R12" V 3950 6350 50  0000 C CNN
F 1 "R" V 4000 6200 50  0000 C CNN
F 2 "68" V 3950 6050 50  0000 C CNN
F 3 "" H 4000 6200 50  0000 C CNN
	1    4000 6200
	0    1    1    0   
$EndComp
Wire Wire Line
	3850 6200 3700 6200
$Comp
L R-RESCUE-computer R13
U 1 1 584B5059
P 4000 6300
F 0 "R13" V 3950 6450 50  0000 C CNN
F 1 "R" V 4000 6300 50  0000 C CNN
F 2 "68" V 3950 6150 50  0000 C CNN
F 3 "" H 4000 6300 50  0000 C CNN
	1    4000 6300
	0    1    1    0   
$EndComp
Wire Wire Line
	3700 6300 3850 6300
Wire Wire Line
	4250 7150 5700 7150
Wire Wire Line
	4150 7050 5700 7050
$Comp
L R-RESCUE-computer R14
U 1 1 584B52A8
P 5500 6700
F 0 "R14" V 5580 6700 50  0000 C CNN
F 1 "R" V 5500 6700 50  0000 C CNN
F 2 "1k5" V 5430 6700 50  0000 C CNN
F 3 "" H 5500 6700 50  0000 C CNN
	1    5500 6700
	1    0    0    -1  
$EndComp
Wire Wire Line
	4150 7050 4150 6300
Wire Wire Line
	4150 6200 4250 6200
Wire Wire Line
	4250 6200 4250 7150
$Comp
L VCC #PWR48
U 1 1 584B5549
P 5500 6500
F 0 "#PWR48" H 5500 6350 50  0001 C CNN
F 1 "VCC" H 5500 6650 50  0000 C CNN
F 2 "" H 5500 6500 50  0000 C CNN
F 3 "" H 5500 6500 50  0000 C CNN
	1    5500 6500
	1    0    0    -1  
$EndComp
Wire Wire Line
	5500 6500 5500 6550
Wire Wire Line
	5500 6850 5500 7050
Connection ~ 5500 7050
Wire Wire Line
	3700 4700 3800 4700
$Comp
L GND-RESCUE-computer #PWR47
U 1 1 584B6068
P 3600 4250
F 0 "#PWR47" H 3600 4000 50  0001 C CNN
F 1 "GND" H 3600 4100 50  0000 C CNN
F 2 "" H 3600 4250 50  0000 C CNN
F 3 "" H 3600 4250 50  0000 C CNN
	1    3600 4250
	1    0    0    -1  
$EndComp
Text GLabel 3900 5300 2    60   Input ~ 0
D0
Text GLabel 3900 5400 2    60   Input ~ 0
D1
Text GLabel 3900 5500 2    60   Input ~ 0
D2
Text GLabel 3900 5600 2    60   Input ~ 0
D3
Text GLabel 3900 5700 2    60   Input ~ 0
D4
Text GLabel 3900 5800 2    60   Input ~ 0
D5
Text GLabel 3900 6000 2    60   Input ~ 0
D6
Text GLabel 3900 6100 2    60   Input ~ 0
D7
Wire Wire Line
	3900 6100 3700 6100
Wire Wire Line
	3700 6000 3900 6000
Wire Wire Line
	3700 5800 3900 5800
Wire Wire Line
	3700 5700 3900 5700
Wire Wire Line
	3700 5600 3900 5600
Wire Wire Line
	3700 5500 3900 5500
Wire Wire Line
	3700 5400 3900 5400
Wire Wire Line
	3700 5300 3900 5300
Text GLabel 4750 1250 0    60   Input ~ 0
~RD
Text GLabel 5850 1800 0    60   Input ~ 0
~WR
Text GLabel 4350 6600 2    60   Input ~ 0
A0
Text GLabel 4350 6700 2    60   Input ~ 0
A1
$Comp
L 4081 U16
U 4 1 584B78EE
P 7600 1700
F 0 "U16" H 7600 1750 50  0000 C CNN
F 1 "4081" H 7600 1650 50  0000 C CNN
F 2 "" H 7600 1700 60  0001 C CNN
F 3 "" H 7600 1700 60  0001 C CNN
	4    7600 1700
	1    0    0    -1  
$EndComp
Wire Wire Line
	4300 1050 5650 1050
Wire Wire Line
	4450 1050 4450 1600
Wire Wire Line
	4450 1600 7000 1600
Connection ~ 4450 1050
Wire Wire Line
	3900 6400 3700 6400
Wire Wire Line
	3900 6500 3700 6500
Wire Wire Line
	4350 6600 3700 6600
Wire Wire Line
	4350 6700 3700 6700
Text GLabel 1000 850  0    60   Input ~ 0
A2
Text GLabel 1000 1200 0    60   Input ~ 0
A3
$Comp
L 74HC14 U15
U 1 1 584B8D9D
P 1450 850
F 0 "U15" H 1600 950 50  0000 C CNN
F 1 "74HC14" H 1650 750 50  0000 C CNN
F 2 "" H 1450 850 50  0000 C CNN
F 3 "" H 1450 850 50  0000 C CNN
	1    1450 850 
	1    0    0    -1  
$EndComp
$Comp
L 74HC14 U15
U 2 1 584B8FFF
P 1450 1200
F 0 "U15" H 1600 1300 50  0000 C CNN
F 1 "74HC14" H 1650 1100 50  0000 C CNN
F 2 "" H 1450 1200 50  0000 C CNN
F 3 "" H 1450 1200 50  0000 C CNN
	2    1450 1200
	1    0    0    -1  
$EndComp
$Comp
L 4081 U16
U 1 1 584B92BC
P 2500 950
F 0 "U16" H 2500 1000 50  0000 C CNN
F 1 "4081" H 2500 900 50  0000 C CNN
F 2 "" H 2500 950 60  0001 C CNN
F 3 "" H 2500 950 60  0001 C CNN
	1    2500 950 
	1    0    0    -1  
$EndComp
Wire Wire Line
	1900 1050 1900 1200
$Comp
L 4081 U16
U 2 1 584B94EA
P 3700 1050
F 0 "U16" H 3700 1100 50  0000 C CNN
F 1 "4081" H 3700 1000 50  0000 C CNN
F 2 "" H 3700 1050 60  0001 C CNN
F 3 "" H 3700 1050 60  0001 C CNN
	2    3700 1050
	1    0    0    -1  
$EndComp
$Comp
L 74HC14 U15
U 3 1 584B95C4
P 2650 1450
F 0 "U15" H 2800 1550 50  0000 C CNN
F 1 "74HC14" H 2850 1350 50  0000 C CNN
F 2 "" H 2650 1450 50  0000 C CNN
F 3 "" H 2650 1450 50  0000 C CNN
	3    2650 1450
	1    0    0    -1  
$EndComp
Text GLabel 2200 1450 0    60   Input ~ 0
~IORQ
Wire Wire Line
	3100 1150 3100 1450
$Comp
L 74HC14 U15
U 4 1 584BA5A4
P 5200 1250
F 0 "U15" H 5350 1350 50  0000 C CNN
F 1 "74HC14" H 5400 1150 50  0000 C CNN
F 2 "" H 5200 1250 50  0000 C CNN
F 3 "" H 5200 1250 50  0000 C CNN
	4    5200 1250
	1    0    0    -1  
$EndComp
$Comp
L 74HC14 U15
U 5 1 584BB2B5
P 6550 1800
F 0 "U15" H 6700 1900 50  0000 C CNN
F 1 "74HC14" H 6750 1700 50  0000 C CNN
F 2 "" H 6550 1800 50  0000 C CNN
F 3 "" H 6550 1800 50  0000 C CNN
	5    6550 1800
	1    0    0    -1  
$EndComp
Wire Wire Line
	5850 1800 6100 1800
Wire Wire Line
	3600 4250 3600 4200
Wire Wire Line
	3800 4700 3800 4200
Text GLabel 1650 5300 0    60   Input ~ 0
~CLK/2
Wire Wire Line
	1650 5300 1800 5300
$Comp
L GND-RESCUE-computer #PWR44
U 1 1 584BE5E7
P 1700 5600
F 0 "#PWR44" H 1700 5350 50  0001 C CNN
F 1 "GND" H 1700 5450 50  0000 C CNN
F 2 "" H 1700 5600 50  0000 C CNN
F 3 "" H 1700 5600 50  0000 C CNN
	1    1700 5600
	1    0    0    -1  
$EndComp
Wire Wire Line
	1700 5600 1700 5500
Wire Wire Line
	1700 5500 1800 5500
$Comp
L GND-RESCUE-computer #PWR46
U 1 1 584BE6C7
P 2700 7250
F 0 "#PWR46" H 2700 7000 50  0001 C CNN
F 1 "GND" H 2700 7100 50  0000 C CNN
F 2 "" H 2700 7250 50  0000 C CNN
F 3 "" H 2700 7250 50  0000 C CNN
	1    2700 7250
	1    0    0    -1  
$EndComp
Wire Wire Line
	2700 7250 2700 7200
$Comp
L VCC #PWR45
U 1 1 584BE78E
P 2700 4200
F 0 "#PWR45" H 2700 4050 50  0001 C CNN
F 1 "VCC" H 2700 4350 50  0000 C CNN
F 2 "" H 2700 4200 50  0000 C CNN
F 3 "" H 2700 4200 50  0000 C CNN
	1    2700 4200
	1    0    0    -1  
$EndComp
Wire Wire Line
	2700 4200 2700 4300
NoConn ~ 1800 4800
NoConn ~ 1800 4900
NoConn ~ 1800 5000
Text GLabel 1650 4600 0    60   Input ~ 0
~RESET
Wire Wire Line
	1650 4600 1800 4600
$Comp
L CONN_02X03 P7
U 1 1 584C0743
P 5550 2800
F 0 "P7" H 5550 3000 50  0000 C CNN
F 1 "CONN_02X03" H 5550 2600 50  0000 C CNN
F 2 "" H 5550 1600 50  0000 C CNN
F 3 "" H 5550 1600 50  0000 C CNN
	1    5550 2800
	1    0    0    -1  
$EndComp
Text Label 5850 2700 0    60   ~ 0
VCC
Text Label 5850 2800 0    60   ~ 0
MOSI
Text Label 5850 2900 0    60   ~ 0
GND
Text Label 5050 2700 0    60   ~ 0
MISO
Text Label 5050 2800 0    60   ~ 0
SCK
Text Label 5050 2900 0    60   ~ 0
RST
$Comp
L GND-RESCUE-computer #PWR52
U 1 1 584C0750
P 6100 3100
F 0 "#PWR52" H 6100 2850 50  0001 C CNN
F 1 "GND" H 6100 2950 50  0000 C CNN
F 2 "" H 6100 3100 50  0000 C CNN
F 3 "" H 6100 3100 50  0000 C CNN
	1    6100 3100
	1    0    0    -1  
$EndComp
$Comp
L VCC #PWR51
U 1 1 584C0756
P 6100 2650
F 0 "#PWR51" H 6100 2500 50  0001 C CNN
F 1 "VCC" H 6100 2800 50  0000 C CNN
F 2 "" H 6100 2650 50  0000 C CNN
F 3 "" H 6100 2650 50  0000 C CNN
	1    6100 2650
	1    0    0    -1  
$EndComp
Wire Wire Line
	5800 2700 6100 2700
Wire Wire Line
	5800 2800 6200 2800
Wire Wire Line
	5800 2900 6100 2900
Wire Wire Line
	4250 2700 5300 2700
Wire Wire Line
	1750 2900 5300 2900
Wire Wire Line
	6200 2800 6200 3050
Wire Wire Line
	6100 2900 6100 3100
Wire Wire Line
	6100 2700 6100 2650
Wire Wire Line
	6200 3050 4150 3050
$Comp
L 4081 U16
U 3 1 584B7860
P 6250 1150
F 0 "U16" H 6250 1200 50  0000 C CNN
F 1 "4081" H 6250 1100 50  0000 C CNN
F 2 "" H 6250 1150 60  0001 C CNN
F 3 "" H 6250 1150 60  0001 C CNN
	3    6250 1150
	1    0    0    -1  
$EndComp
Text GLabel 8200 1700 2    60   Input ~ 0
W
Text GLabel 8200 1150 2    60   Input ~ 0
R
Wire Wire Line
	6850 1150 8200 1150
Text GLabel 3900 6400 2    60   Input ~ 0
R
Text GLabel 3900 6500 2    60   Input ~ 0
W
Wire Wire Line
	5350 2800 4050 2800
Wire Wire Line
	4050 2800 4050 4800
Connection ~ 4050 4800
Wire Wire Line
	4150 3050 4150 4900
Connection ~ 4150 4900
Wire Wire Line
	4250 5000 4250 2700
Connection ~ 4250 5000
Wire Wire Line
	1750 2900 1750 4600
Connection ~ 1750 4600
NoConn ~ 9800 1200
NoConn ~ 10400 2100
$Comp
L D D4
U 1 1 5846AF79
P 9450 3600
F 0 "D4" H 9450 3700 50  0000 C CNN
F 1 "D" H 9450 3500 50  0000 C CNN
F 2 "1N4001" H 9450 3800 50  0000 C CNN
F 3 "" H 9450 3600 50  0000 C CNN
	1    9450 3600
	-1   0    0    1   
$EndComp
$Comp
L VCC #PWR54
U 1 1 5846B187
P 9200 3500
F 0 "#PWR54" H 9200 3350 50  0001 C CNN
F 1 "VCC" H 9200 3650 50  0000 C CNN
F 2 "" H 9200 3500 50  0000 C CNN
F 3 "" H 9200 3500 50  0000 C CNN
	1    9200 3500
	1    0    0    -1  
$EndComp
Wire Wire Line
	9200 3500 9200 3600
Wire Wire Line
	9200 3600 9300 3600
Wire Wire Line
	9600 3600 9750 3600
Wire Wire Line
	10050 3600 10300 3600
$Comp
L +3.3V-RESCUE-computer #PWR56
U 1 1 5846B372
P 10300 3500
F 0 "#PWR56" H 10300 3350 50  0001 C CNN
F 1 "+3.3V" H 10300 3640 50  0000 C CNN
F 2 "" H 10300 3500 50  0000 C CNN
F 3 "" H 10300 3500 50  0000 C CNN
	1    10300 3500
	1    0    0    -1  
$EndComp
Wire Wire Line
	10300 3500 10300 3700
$Comp
L R-RESCUE-computer R16
U 1 1 5846B449
P 10300 3850
F 0 "R16" V 10380 3850 50  0000 C CNN
F 1 "R" V 10300 3850 50  0000 C CNN
F 2 "10k" V 10230 3850 50  0000 C CNN
F 3 "" H 10300 3850 50  0000 C CNN
	1    10300 3850
	1    0    0    -1  
$EndComp
$Comp
L GND-RESCUE-computer #PWR57
U 1 1 5846B4C2
P 10300 4100
F 0 "#PWR57" H 10300 3850 50  0001 C CNN
F 1 "GND" H 10300 3950 50  0000 C CNN
F 2 "" H 10300 4100 50  0000 C CNN
F 3 "" H 10300 4100 50  0000 C CNN
	1    10300 4100
	1    0    0    -1  
$EndComp
Wire Wire Line
	10300 4100 10300 4000
Connection ~ 10300 3600
$Comp
L D D5
U 1 1 5846BC40
P 9900 3600
F 0 "D5" H 9900 3700 50  0000 C CNN
F 1 "D" H 9900 3500 50  0000 C CNN
F 2 "1N4001" H 9900 3800 50  0000 C CNN
F 3 "" H 9900 3600 50  0000 C CNN
	1    9900 3600
	-1   0    0    1   
$EndComp
Text Notes 8700 4050 0    60   ~ 0
Voltage converter (5V to 3.3V)
Text Notes 3250 2050 0    60   ~ 0
Device selector\n(must have A2=0, A3=0, IORQ=0)
$EndSCHEMATC
