{
  "MONGO_DB_NAME": "seed_db",
  "MONGO_HOSTS": ["localhost:27017"],
  "db": {
    "database": "seed_db",
    "type": "postgres",
    "migrations": [
      "migrations/**/*.ts"
    ],
    "synchronize": false,
    "username": "seed_user",
    "host": "postgres",
    "port": 5432
  },
  "server": {
    "host": "0.0.0.0",
    "port": 8080
  }
}