<svg xmlns:dc="http://purl.org/dc/elements/1.1/" xmlns:cc="http://creativecommons.org/ns#" xmlns:rdf="http://www.w3.org/1999/02/22-rdf-syntax-ns#" xmlns:svg="http://www.w3.org/2000/svg" xmlns="http://www.w3.org/2000/svg" xmlns:sodipodi="http://sodipodi.sourceforge.net/DTD/sodipodi-0.dtd" xmlns:inkscape="http://www.inkscape.org/namespaces/inkscape" width="546.13336" height="546.13336" viewBox="0 0 512.00001 512.00001" id="svg4519" version="1.1" inkscape:version="0.92.4 5da689c313, 2019-01-14" sodipodi:docname="logo.svg" inkscape:export-filename="/home/nebulon/Cloudron/Assets/logo_115.png" inkscape:export-xdpi="20.214842" inkscape:export-ydpi="20.214842">
<defs id="defs4521"></defs>
<sodipodi:namedview id="base" pagecolor="#ffffff" bordercolor="#666666" borderopacity="1.0" inkscape:pageopacity="0.0" inkscape:pageshadow="2" inkscape:zoom="0.98994949" inkscape:cx="-217.49977" inkscape:cy="326.06782" inkscape:document-units="px" inkscape:current-layer="g4496" showgrid="false" units="px" inkscape:window-width="2880" inkscape:window-height="1564" inkscape:window-x="0" inkscape:window-y="56" inkscape:window-maximized="1"></sodipodi:namedview>
<metadata id="metadata4524">
<rdf:rdf>
<cc:work rdf:about="">
<dc:format>image/svg+xml</dc:format>
<dc:type rdf:resource="http://purl.org/dc/dcmitype/StillImage"></dc:type>
<dc:title></dc:title>
</cc:work>
</rdf:rdf>
</metadata>
<g inkscape:label="Layer 1" inkscape:groupmode="layer" id="layer1" transform="translate(0,-540.36216)">
<g id="g4467" transform="matrix(20.50952,0,0,20.859456,-526.58031,-94.042799)">
<g inkscape:export-ydpi="67.349998" inkscape:export-xdpi="67.349998" transform="matrix(0.59473169,0,0,0.59473169,31.04719,102.48374)" id="g4382">
<g id="g4496">
<path sodipodi:type="star" style="opacity:1;fill:#03a9f4;fill-opacity:1;stroke:none;stroke-width:1.10000002;stroke-miterlimit:4;stroke-dasharray:none;stroke-dashoffset:0;stroke-opacity:1" id="path4162" sodipodi:sides="6" sodipodi:cx="12.46875" sodipodi:cy="-99.893143" sodipodi:r1="19.266006" sodipodi:r2="16.307295" sodipodi:arg1="-0.52224059" sodipodi:arg2="0.0013581913" inkscape:flatsided="true" inkscape:rounded="0.12490573" inkscape:randomized="0" d="m 29.166669,-109.50348 c 1.200386,2.08567 1.17988,17.183595 -0.02617,19.265993 -1.206046,2.082397 -14.291486,9.613601 -16.697919,9.610333 -2.406432,-0.0033 -15.4713664,-7.56999 -16.671752,-9.655655 -1.2003857,-2.085666 -1.1798799,-17.183591 0.026167,-19.265991 1.2060467,-2.0824 14.2914862,-9.6136 16.6979192,-9.61033 2.406432,0.003 15.471366,7.56999 16.671752,9.65565 z" transform="rotate(-30,10.993604,-99.259973)" inkscape:export-xdpi="67.349998" inkscape:export-ydpi="67.349998"></path>
<rect inkscape:transform-center-x="0.40624986" ry="2.4183984" y="-104.9176" x="2.2207832" height="8.7434387" width="8.7434387" id="rect4168-1-1" style="opacity:1;fill:#ffffff;fill-opacity:1;stroke:none;stroke-width:2.29999995;stroke-miterlimit:4;stroke-dasharray:none;stroke-dashoffset:0;stroke-opacity:1"></rect>
<g transform="translate(0,0.14463441)" id="g4491">
<rect style="opacity:1;fill:#ffffff;fill-opacity:1;stroke:none;stroke-width:2.29999995;stroke-miterlimit:4;stroke-dasharray:none;stroke-dashoffset:0;stroke-opacity:1" id="rect4168-1-1-7" width="8.7434387" height="8.7434387" x="9.0890703" y="-98.734459" ry="2.4183986"></rect>
<rect style="opacity:1;fill:#ffffff;fill-opacity:1;stroke:none;stroke-width:2.29999995;stroke-miterlimit:4;stroke-dasharray:none;stroke-dashoffset:0;stroke-opacity:1" id="rect4168-1-1-7-2" width="8.7434387" height="8.7434387" x="9.0890703" y="-111.39002" ry="2.4183986"></rect>
</g>
</g>
</g>
</g>
</g>
</svg>