<?xml version="1.0" encoding="UTF-8" standalone="no"?>
<!-- Created with Inkscape (http://www.inkscape.org/) -->

<svg
   xmlns:dc="http://purl.org/dc/elements/1.1/"
   xmlns:cc="http://creativecommons.org/ns#"
   xmlns:rdf="http://www.w3.org/1999/02/22-rdf-syntax-ns#"
   xmlns:svg="http://www.w3.org/2000/svg"
   xmlns="http://www.w3.org/2000/svg"
   xmlns:sodipodi="http://sodipodi.sourceforge.net/DTD/sodipodi-0.dtd"
   xmlns:inkscape="http://www.inkscape.org/namespaces/inkscape"
   width="525"
   height="275"
   viewBox="0 0 525.00001 275"
   id="svg3388"
   version="1.1"
   inkscape:version="0.91 r13725"
   sodipodi:docname="logo.svg">
  <defs
     id="defs3390" />
  <sodipodi:namedview
     id="base"
     pagecolor="#ffffff"
     bordercolor="#666666"
     borderopacity="1.0"
     inkscape:pageopacity="0.0"
     inkscape:pageshadow="2"
     inkscape:zoom="1.4"
     inkscape:cx="73.481827"
     inkscape:cy="154.3851"
     inkscape:document-units="px"
     inkscape:current-layer="text36"
     showgrid="false"
     units="px"
     inkscape:window-width="1920"
     inkscape:window-height="1024"
     inkscape:window-x="0"
     inkscape:window-y="30"
     inkscape:window-maximized="1" />
  <metadata
     id="metadata3393">
    <rdf:RDF>
      <cc:Work
         rdf:about="">
        <dc:format>image/svg+xml</dc:format>
        <dc:type
           rdf:resource="http://purl.org/dc/dcmitype/StillImage" />
        <dc:title />
      </cc:Work>
    </rdf:RDF>
  </metadata>
  <g
     inkscape:label="Layer 1"
     inkscape:groupmode="layer"
     id="layer1"
     transform="translate(0,-777.36216)">
    <path
       d="m 417.8779,935.97899 c -0.90679,-0.41083 -1.4891,-1.31392 -1.49157,-2.31076 -0.0123,-5.63687 -3.78505,-16.72061 -19.54089,-25.79955 -13.30814,-7.66881 -38.59323,-7.0976 -57.57401,-5.75778 -58.69546,4.1416 -126.57474,39.35814 -214.27989,39.35814 -65.608233,0 -93.007425,-27.20353 -102.743203,-42.37705 -0.376413,-0.58848 -0.26747,-1.36449 0.260679,-1.82344 0.527174,-0.46017 1.312313,-0.46141 1.842439,-0.007 16.234401,13.92377 46.128177,38.87205 99.257085,36.61311 127.748,-14.7775 205.25646,-112.15748 302.44892,-102.14461 20.13925,2.07512 29.20709,10.98628 32.41846,18.49223 0.17519,0.40466 0.59835,0.64647 1.03509,0.58602 0.43797,-0.0617 0.78095,-0.40713 0.8414,-0.84634 2.39342,-18.32074 13.32541,-26.22765 25.48125,-31.67329 0.17149,-0.0777 0.28252,-0.24674 0.28499,-0.4355 0.005,-0.18629 -0.0999,-0.36025 -0.26772,-0.44414 -10.94803,-5.47525 -10.53843,-18.49716 -9.00492,-32.63436 0.0592,-0.53544 0.4133,-0.99191 0.91665,-1.18067 0.50583,-0.18876 1.07211,-0.0765 1.4669,0.28992 9.68717,9.00246 14.45796,17.58668 12.53089,31.92004 -0.0235,0.16902 0.0382,0.33681 0.16039,0.45524 0.12337,0.11721 0.29732,0.16902 0.46141,0.13695 3.05592,-0.57122 5.2322,-0.57492 7.85756,-0.0839 0.2122,0.0407 0.43057,-0.0383 0.56998,-0.20603 0.13694,-0.16902 0.17148,-0.39602 0.0901,-0.59835 -5.19273,-12.89238 -5.23344,-21.68633 -0.54654,-34.42449 0.17272,-0.46511 0.60206,-0.78958 1.09678,-0.82659 0.49719,-0.0395 0.96847,0.21713 1.21028,0.65263 7.46154,13.49937 9.51321,24.59051 4.14036,37.51619 -0.17395,0.41453 -0.0653,0.89322 0.27019,1.19425 11.43164,10.31513 15.83603,37.1473 11.15653,39.43709 -4.12927,2.0196 -19.6581,-10.73337 -27.17392,-19.82095 -0.35531,-0.43303 -0.9475,-0.58848 -1.47306,-0.39109 -0.52557,0.1974 -0.86484,0.70569 -0.8488,1.26703 0.55764,18.46262 2.25524,34.61695 -1.6939,38.52168 -0.17395,0.17148 -0.23811,0.4244 -0.16532,0.66127 0.0703,0.23441 0.26649,0.40836 0.50706,0.45524 21.1694,4.04044 22.20326,31.2452 18.08634,31.30318 -2.50816,0.0345 -2.15408,-19.94185 -23.13349,-20.19846 -4.52528,-0.0543 -7.06058,-2.09856 -8.94323,-6.18094 -0.1937,-0.42193 -0.63167,-0.16038 -0.58725,0.079 5.32103,28.41997 -3.41864,41.51714 -33.43998,46.63585 -0.43921,0.0752 -0.78095,0.41576 -0.85991,0.8525 -0.079,0.43673 0.12584,0.87594 0.51076,1.09554 25.8267,14.90087 43.61571,27.08879 40.55978,48.14962 -2.08005,14.31241 -17.80258,15.7348 -17.95309,4.1416 -0.43427,-33.40173 -20.61053,-39.1373 -43.74154,-49.64859"
       style="fill:#f0921a;fill-opacity:1;fill-rule:nonzero;stroke:none"
       id="path18"
       inkscape:connector-curvature="0" />
    <path
       d="m 53.511047,994.09585 c 0,0.49842 -0.29252,1.1523 -0.878043,1.96162 -5.131535,6.81883 -11.950177,10.22653 -20.455689,10.22653 -8.700075,0 -15.755472,-3.3151 -21.165453,-9.94653 -5.2708268,-6.41287 -7.9059244,-14.50728 -7.9059244,-24.28328 0,-9.46387 2.5787215,-17.49538 7.7381384,-24.09702 5.381605,-6.91006 12.228257,-10.36571 20.539089,-10.36571 9.035517,0 16.118304,3.09663 21.249839,9.29238 0.557029,0.68594 0.83659,1.29293 0.83659,1.8222 0,0.59095 -0.969092,2.78574 -2.907384,6.58313 -1.938303,3.79986 -3.15857,5.93173 -3.660201,6.39807 -0.223678,0.25045 -0.501759,0.37505 -0.836709,0.37505 -0.139657,0 -0.83659,-0.62303 -2.09153,-1.86908 -1.505997,-1.49404 -2.983994,-2.66114 -4.433615,-3.50253 -2.203799,-1.24483 -4.490622,-1.86786 -6.860222,-1.86786 -4.099158,0 -7.37728,1.71117 -9.830657,5.13721 -2.258318,3.17437 -3.387912,7.09759 -3.387912,11.76846 0,4.73131 1.129594,8.70019 3.387912,11.90663 2.453377,3.48773 5.731499,5.23094 9.830657,5.23094 2.425986,0 4.726745,-0.5909 6.901675,-1.77529 1.422104,-0.77724 2.871725,-1.86662 4.350709,-3.26936 1.226564,-1.1819 1.909433,-1.77285 2.049209,-1.77285 0.278574,0 0.558016,0.17148 0.837084,0.51322 0.445244,0.56011 1.658731,2.50569 3.63898,5.83675 2.035145,3.4556 3.053457,5.35553 3.053457,5.69732"
       style="fill:#f0921a;fill-opacity:1;fill-rule:nonzero;stroke:none"
       id="path20"
       inkscape:connector-curvature="0" />
    <path
       d="m 83.544726,969.75454 c -0.584783,1.09924 -1.57546,3.48526 -2.969564,7.16174 -1.506372,3.89979 -2.258941,6.18711 -2.258941,6.86319 0,0.44784 0.836462,0.69951 2.51062,0.7501 0.863604,0.0506 2.286083,0.074 4.266204,0.074 1.84071,0 2.858529,-0.19986 3.053457,-0.59959 0.05547,-0.1246 0.08389,-0.29856 0.08389,-0.52433 0,-0.82536 -0.641535,-3.10034 -1.924604,-6.82494 -1.254693,-3.60123 -2.175048,-5.89965 -2.761065,-6.90019 z m 29.658624,34.16276 c 0,0.4506 -0.34915,0.7639 -1.0462,0.9378 -0.83646,0.1985 -3.42974,0.2998 -7.78107,0.2998 -3.98738,0 -6.553513,-0.1013 -7.695937,-0.2998 -0.948731,-0.1739 -1.548319,-0.7364 -1.798764,-1.6877 -0.948731,-3.59873 -1.687729,-5.52583 -2.216995,-5.77503 -0.446607,-0.1752 -4.183544,-0.2629 -11.210813,-0.2629 -4.741186,0 -7.264144,0.1136 -7.57134,0.3369 -0.474982,0.4009 -1.004248,1.7383 -1.589031,4.01323 -0.5305,2.0762 -1.172034,3.2016 -1.924603,3.3755 -0.947497,0.1985 -4.128027,0.2998 -9.537149,0.2998 -4.266944,0 -6.399927,-0.3639 -6.399927,-1.0868 0,-0.6515 3.150308,-8.63736 9.453384,-23.96389 6.831601,-16.57749 10.541397,-25.68975 11.127414,-27.338 0.334338,-0.9512 0.724193,-1.42741 1.1708,-1.42741 0.752569,0 1.917201,0.0642 3.492661,0.18999 1.575461,0.12461 2.753663,0.18506 3.534608,0.18506 0.753803,0 1.861683,-0.0431 3.326109,-0.12954 1.463192,-0.0888 2.557501,-0.13324 3.282929,-0.13324 0.529266,0 1.017819,0.41329 1.464425,1.23989 1.365728,2.62535 5.354345,11.62411 11.963379,27.00119 6.63618,15.47575 9.95612,23.55055 9.95612,24.22515"
       style="fill:#f0921a;fill-opacity:1;fill-rule:nonzero;stroke:none"
       id="path22"
       inkscape:connector-curvature="0" />
    <path
       d="m 173.43849,954.27382 c 0,2.80178 -0.13201,7.00876 -0.39726,12.62342 -0.26525,5.61466 -0.39725,9.83398 -0.39725,12.65797 l 0,24.28919 c 0,0.6652 -0.40466,0.9958 -1.21275,0.9958 -0.66991,0 -1.68156,0.024 -3.03372,0.074 -1.35216,0.048 -2.36257,0.074 -3.03248,0.074 -0.72543,0 -1.81357,-0.049 -3.26196,-0.1484 -1.45085,-0.099 -2.53899,-0.1479 -3.26319,-0.1479 -0.50212,0 -1.10294,-0.4059 -1.79876,-1.2165 -2.00726,-2.3812 -6.52638,-7.66507 -13.55365,-15.8471 -1.92337,-2.28485 -4.85099,-5.65167 -8.78408,-10.098 -0.11104,-0.14681 -0.32077,-0.29486 -0.62673,-0.44291 -0.22331,0.17149 -0.33558,0.44291 -0.33558,0.81179 0,2.84989 0.0901,7.12473 0.27266,12.82447 0.18012,5.70107 0.27141,9.97735 0.27141,12.82705 0,0.8597 -0.37628,1.2891 -1.12885,1.2891 l -14.474,0 c -0.80932,0 -1.21275,-0.3797 -1.21275,-1.1411 0,-2.655 0.14558,-6.65963 0.43921,-12.0164 0.29362,-5.35681 0.4392,-9.37257 0.4392,-12.05098 0,-2.82521 -0.13324,-7.05317 -0.39726,-12.67894 -0.26525,-5.62699 -0.39726,-9.84015 -0.39726,-12.64192 0,-0.53914 0.54407,-0.81056 1.63098,-0.81056 1.61741,0 3.6111,-0.0987 5.98231,-0.29486 0.55764,-0.0494 1.65812,-0.2085 3.3039,-0.47868 1.39411,-0.22207 2.49582,-0.33187 3.30514,-0.33187 0.33434,0 0.85003,0.41823 1.54708,1.25346 l 15.60286,18.8315 c 1.3941,1.69636 3.50006,4.17738 6.31665,7.44673 0.69581,0.76121 1.29664,1.14119 1.79876,1.14119 0.36148,0 0.54284,-0.95736 0.54284,-2.87333 0,-2.58094 -0.15915,-6.46223 -0.47992,-11.64878 -0.32077,-5.18286 -0.48115,-9.07648 -0.48115,-11.68086 0,-0.91049 0.29239,-1.3645 0.87841,-1.3645 1.67292,0 4.19588,-0.0629 7.57134,-0.18382 3.37422,-0.12338 5.89841,-0.18629 7.57134,-0.18629 0.52926,0 0.79451,0.38245 0.79451,1.14365"
       style="fill:#f0921a;fill-opacity:1;fill-rule:nonzero;stroke:none"
       id="path24"
       inkscape:connector-curvature="0" />
    <path
       d="m 236.26691,1003.4821 c 0.0556,0.7523 -0.33433,1.1286 -1.1708,1.1286 -0.5305,0 -2.05661,-0.3059 -4.5808,-0.9189 -2.52419,-0.6132 -4.07744,-1.0313 -4.66346,-1.256 -5.82933,2.2873 -11.41931,3.4309 -16.77366,3.4309 -8.61753,0 -15.68675,-2.8732 -21.20888,-8.61743 -5.46538,-5.66162 -8.19807,-12.8147 -8.19807,-21.45814 0,-8.84084 2.6488,-16.1753 7.94763,-22.0034 5.46538,-6.02302 12.56297,-9.03576 21.29154,-9.03576 4.23906,0 8.22644,0.80932 11.96338,2.42549 4.0429,1.78643 7.2222,4.29581 9.53789,7.53063 0.47251,0.66991 0.71062,1.14366 0.71062,1.42124 0,0.89445 -1.24852,2.89431 -3.74434,6.00328 -2.49581,3.11021 -4.10582,4.6647 -4.83125,4.6647 -0.16778,0 -0.80932,-0.57121 -1.92336,-1.7161 -1.36697,-1.3645 -2.76107,-2.4255 -4.18355,-3.17807 -2.11953,-1.14366 -4.46236,-1.7161 -7.02727,-1.7161 -4.18354,0 -7.50225,1.56312 -9.95612,4.68567 -2.28732,2.8721 -3.42974,6.45605 -3.42974,10.75063 0,4.54503 1.18561,8.14255 3.55558,10.79135 2.45387,2.73394 5.92556,4.09962 10.41507,4.09962 2.84495,0 6.02425,-0.71062 9.53788,-2.13305 -0.0839,-0.92035 -0.33433,-3.26321 -0.75256,-7.02852 -0.36395,-2.89924 -0.54408,-5.24208 -0.54408,-7.02727 0,-0.52927 0.18013,-0.8488 0.54408,-0.96107 0.13941,-0.0556 0.36148,-0.0852 0.66867,-0.0852 0.80932,0 2.02824,0.0778 3.66045,0.2307 1.63098,0.15422 2.8647,0.23071 3.70239,0.23071 0.89198,0 2.23057,-0.0629 4.01576,-0.18876 1.78396,-0.12461 3.12255,-0.18753 4.01453,-0.18753 0.69705,0 1.04619,0.46018 1.04619,1.38053 0,1.33859 -0.0765,3.36066 -0.22947,6.06497 -0.15422,2.70432 -0.23071,4.72638 -0.23071,6.06497 0,3.59755 0.26525,8.98022 0.79575,16.14691 l 0.0408,0.4602"
       style="fill:#f0921a;fill-opacity:1;fill-rule:nonzero;stroke:none"
       id="path26"
       inkscape:connector-curvature="0" />
    <path
       d="m 292.06807,980.97152 c 0,8.19685 -0.85003,13.79054 -2.55133,16.77975 -3.12255,5.46533 -10.91719,8.19833 -23.3827,8.19833 -5.6344,0 -9.96969,-0.4984 -13.00958,-1.4939 -4.85222,-1.6078 -8.00314,-4.67863 -9.45276,-9.2113 -0.72666,-2.21695 -1.08814,-6.17107 -1.08814,-11.86096 0,-1.31885 0.0419,-3.27923 0.12584,-5.88361 0.0826,-2.60438 0.12584,-4.54872 0.12584,-5.83426 0,-3.73077 -0.15422,-9.32322 -0.46141,-16.78353 -0.3072,-7.45783 -0.46018,-13.03425 -0.46018,-16.73047 0,-0.77231 0.29363,-1.1597 0.87841,-1.1597 1.7013,0 4.27361,0.0826 7.71815,0.24304 3.44455,0.16162 6.01685,0.24058 7.71815,0.24058 0.69706,0 1.04496,0.35408 1.04496,1.061 0,4.24399 -0.11843,10.60012 -0.35531,19.07084 -0.23687,8.47195 -0.35531,14.82808 -0.35531,19.07208 0,5.04838 0.46018,8.45591 1.38053,10.2226 1.22632,2.41194 3.79123,3.61605 7.69595,3.61605 5.71706,0 8.57682,-3.1978 8.57682,-9.59466 0,-4.66222 -0.0987,-11.65495 -0.29362,-20.97694 -0.19617,-9.32199 -0.2924,-16.31594 -0.2924,-20.97694 0,-0.99561 0.34791,-1.49403 1.0462,-1.49403 1.64455,0 4.12556,-0.079 7.4455,-0.24058 3.31747,-0.16038 5.79972,-0.24304 7.4455,-0.24304 0.80809,0 1.21275,0.38739 1.21275,1.1597 0,3.69622 -0.13325,9.27264 -0.39726,16.73047 -0.26649,7.46031 -0.39726,13.05276 -0.39726,16.78353 0,1.02769 0.0135,2.57847 0.0419,4.65236 0.0271,2.07265 0.0408,3.62467 0.0408,4.65359"
       style="fill:#f0921a;fill-opacity:1;fill-rule:nonzero;stroke:none"
       id="path28"
       inkscape:connector-curvature="0" />
    <path
       d="m 332.60317,955.08067 c 0,-4.45126 -1.11651,-7.53556 -3.34708,-9.25166 -1.72968,-1.31392 -4.43399,-1.97149 -8.11418,-1.97149 -2.65126,0 -4.0577,0.5305 -4.22549,1.5878 -0.16778,1.24235 -0.25044,4.81767 -0.25044,10.73213 0,0.84016 0.0136,2.08128 0.0407,3.7246 0.0271,1.64085 0.0419,2.86346 0.0419,3.66661 0,0.18383 0.44537,0.36519 1.33858,0.54778 1.7013,0.32693 3.48526,0.49348 5.35435,0.49348 6.10691,0 9.1616,-3.17559 9.1616,-9.52925 z m 17.56817,49.11563 c 0,0.2554 -0.28005,0.4381 -0.83769,0.5466 -1.05853,0.2182 -3.72213,0.3282 -7.98834,0.3282 -3.65304,0 -6.13529,-0.11 -7.4455,-0.3282 -0.61439,-0.1085 -0.96353,-0.2011 -1.04619,-0.2738 -0.16779,-0.11 -0.36272,-0.4738 -0.58602,-1.0945 -0.41823,-1.4251 -1.03262,-3.54073 -1.84071,-6.35123 -1.08691,-3.65048 -2.78944,-9.03572 -5.1039,-16.15302 -0.50089,-1.42248 -1.65812,-2.20835 -3.47045,-2.35393 0.83646,0.0727 -0.59959,0.1098 -4.30815,0.1098 -0.41947,0 -0.62797,0.93022 -0.62797,2.79191 0,2.48347 0.17396,6.18835 0.5231,11.11583 0.34791,4.92621 0.5231,8.63244 0.5231,11.11444 0,0.6207 -0.12584,0.986 -0.37752,1.0945 -0.39109,0.038 -0.78095,0.073 -1.1708,0.1084 -1.64578,0.1469 -4.21069,0.2198 -7.69718,0.2198 -3.98738,0 -6.38573,-0.11 -7.19505,-0.3282 -0.80933,-0.2184 -1.21275,-0.7837 -1.21275,-1.6974 0,-4.01363 0.14681,-10.07608 0.4392,-18.17789 0.29363,-8.10308 0.43921,-14.18161 0.43921,-18.23192 0,-15.44124 -0.26525,-27.48728 -0.79452,-36.13812 l -0.042,-0.76614 c -0.0271,-0.61933 0.41083,-1.0388 1.31762,-1.2584 0.90555,-0.2196 5.16558,-0.4392 12.77887,-0.65757 5.15942,-0.14558 9.27264,-0.2196 12.3409,-0.2196 6.35736,0 11.54392,1.88142 15.55968,5.6381 4.54625,4.23659 6.81877,10.34844 6.81877,18.34418 0,5.32967 -0.58479,9.58107 -1.75682,12.75666 -1.17203,3.17807 -3.33228,6.26237 -6.4832,9.25414 -0.64277,0.58355 -0.9623,1.13009 -0.9623,1.64208 0,-0.037 1.70007,4.54502 5.10267,13.74361 3.4026,9.19864 5.10389,14.27177 5.10389,15.22167"
       style="fill:#f0921a;fill-opacity:1;fill-rule:nonzero;stroke:none"
       id="path30"
       inkscape:connector-curvature="0" />
    <path
       d="m 404.84241,976.31176 c 0,9.72665 -0.85003,16.36285 -2.55133,19.91102 -3.12255,6.48572 -10.91719,9.72682 -23.3827,9.72682 -5.63316,0 -9.96969,-0.5923 -13.00957,-1.7745 -4.85222,-1.9045 -8.00314,-5.54903 -9.45277,-10.92686 -0.72542,-2.63148 -1.08814,-7.32334 -1.08814,-14.07425 0,-1.56436 0.042,-3.89115 0.12584,-6.98162 0.0839,-3.08924 0.12461,-5.39629 0.12461,-6.92241 0,-4.42535 -0.15298,-11.06153 -0.45894,-19.91224 -0.3072,-8.84824 -0.46018,-15.46591 -0.46018,-19.85302 0,-0.91665 0.29239,-1.37436 0.87841,-1.37436 1.70006,0 4.2736,0.0974 7.71691,0.28622 3.44455,0.18999 6.01686,0.28622 7.71816,0.28622 0.69705,0 1.04496,0.4207 1.04496,1.25963 0,5.03481 -0.11844,12.57778 -0.35531,22.62766 -0.23688,10.05112 -0.35532,17.59408 -0.35532,22.63013 0,5.98847 0.46018,10.03261 1.38054,12.1287 1.22632,2.86099 3.79245,4.29213 7.69718,4.29213 5.71582,0 8.57558,-3.79494 8.57558,-11.38602 0,-5.53077 -0.0987,-13.8263 -0.29239,-24.88907 -0.19739,-11.06153 -0.29362,-19.35953 -0.29362,-24.88907 0,-1.1819 0.34791,-1.77409 1.04619,-1.77409 1.64455,0 4.12679,-0.0962 7.4455,-0.28622 3.31747,-0.18876 5.79972,-0.28622 7.4455,-0.28622 0.80809,0 1.21398,0.45771 1.21398,1.37436 0,4.38711 -0.13447,11.00478 -0.39849,19.85302 -0.26648,8.85071 -0.39726,15.48689 -0.39726,19.91224 0,1.22139 0.0136,3.06086 0.0419,5.5209 0.0271,2.46004 0.0407,4.29952 0.0407,5.5209"
       style="fill:#f0921a;fill-opacity:1;fill-rule:nonzero;stroke:none"
       id="path32"
       inkscape:connector-curvature="0" />
    <g
       id="g34"
       transform="matrix(1.23372,0,0,-1.23372,-57.986396,1123.4353)">
      <g
         transform="matrix(1,0,0,-1,244.663,59.3141)"
         style="font-variant:normal;font-weight:bold;font-size:36.73429871px;font-family:BerlinSansFBDemi;-inkscape-font-specification:BerlinSansFBDemi-Bold;writing-mode:lr-tb;fill:#f0921a;fill-opacity:1;fill-rule:nonzero;stroke:none"
         id="text36">
        <path
           d="m 25.721184,-0.55603675 q 0,0.37667006 -0.16143,0.4663534 Q 25.488007,-0.03587334 25.057527,0 23.96339,0.10762002 21.97242,0.10762002 19.156363,0.10762002 18.654136,0 q -0.48429,-0.10762002 -0.48429,-0.48429007 0,-1.41699683 0.125557,-4.25099063 0.143493,-2.8519304 0.143493,-4.2689273 0,-0.6995301 -0.394607,-0.8071501 -0.609846,-0.1434934 -4.340674,-0.1434934 -3.7487635,0 -4.376547,0.1434934 -0.3946067,0.089683 -0.3946067,0.8071501 0,1.3990602 0.089683,4.1971806 0.089683,2.7801838 0.089683,4.17924397 Q 9.111828,-0.08968335 8.6275379,0 8.0535645,0.10762002 5.2554441,0.10762002 2.8339937,0.10762002 2.170337,0 1.6501736,-0.08968335 1.6501736,-0.55603675 q 0,-1.93716025 0.1793667,-5.84735415 0.1973033,-3.9101941 0.1973033,-5.8652911 0,-2.080653 -0.1793667,-6.241961 -0.1793667,-4.179244 -0.1793667,-6.259897 0,-0.394607 0.3766701,-0.394607 0.5560367,0 1.6681102,0.05381 1.1300102,0.05381 1.686047,0.05381 0.5739734,0 1.7219202,-0.05381 1.1658835,-0.05381 1.7398569,-0.05381 0.3049234,0 0.3049234,0.32286 0,1.34525 -0.1973034,4.035751 -0.1973033,2.672563 -0.1973033,4.017814 0,0.627783 0.3407967,0.735403 0.4663534,0.143493 4.591787,0.143493 3.838448,0 4.448294,-0.143493 0.43048,-0.10762 0.43048,-0.735403 0,-1.291441 -0.125556,-3.892258 -0.125557,-2.618753 -0.125557,-3.92813 0,-0.556037 0.448417,-0.556037 0.520163,0 1.578427,0.05381 1.0762,0.05381 1.6143,0.05381 0.520163,0 1.578427,-0.05381 1.0762,-0.05381 1.6143,-0.05381 0.520163,0 0.520163,0.43048 0,2.062717 -0.179366,6.224024 -0.16143,4.161308 -0.16143,6.241961 0,1.955097 0.179366,5.8652911 0.197304,3.9101939 0.197304,5.84735415 z"
           style="font-style:normal;font-variant:normal;font-weight:bold;font-stretch:normal;font-family:BerlinSansFBDemi;-inkscape-font-specification:'BerlinSansFBDemi Bold'"
           id="path3345" />
        <path
           d="m 53.935825,-12.555669 q 0,5.5962413 -3.569397,9.3808785 -3.641144,3.83844726 -9.219448,3.83844726 -5.542431,0 -9.201511,-3.87432056 -3.587334,-3.7846372 -3.587334,-9.3450052 0,-5.578304 3.587334,-9.380878 3.65908,-3.892257 9.201511,-3.892257 5.506558,0 9.183575,3.892257 3.60527,3.838448 3.60527,9.380878 z m -6.797997,-0.03587 q 0,-2.6905 -1.632237,-4.573851 -1.703984,-1.973033 -4.358611,-1.973033 -2.52907,0 -4.286864,2.04478 -1.703983,1.973034 -1.703983,4.537977 0,2.7443109 1.596363,4.5738512 1.686047,1.9192236 4.394484,1.9192236 2.529071,0 4.304801,-2.0268436 1.686047,-1.9371602 1.686047,-4.5021042 z"
           style="font-style:normal;font-variant:normal;font-weight:bold;font-stretch:normal;font-family:BerlinSansFBDemi;-inkscape-font-specification:'BerlinSansFBDemi Bold'"
           id="path3347" />
        <path
           d="m 68.840498,-8.2508679 q 0,3.6411439 -3.067171,6.2419609 -2.6905,2.29589371 -6.546884,2.92367713 -0.143493,0.0179367 -0.233177,0.0179367 -0.412543,0 -1.82954,-2.5111337 -1.416997,-2.5290704 -1.416997,-3.0851071 0,-0.1973034 0.26905,-0.2511134 2.600817,-0.5919101 3.443841,-1.0044535 1.865413,-0.9327068 1.865413,-2.762247 0,-1.1658835 -1.219693,-2.6008171 -2.116527,-2.439387 -2.295894,-2.708437 -1.23763,-1.865414 -1.23763,-4.125434 0,-3.28241 3.031297,-5.452747 2.47526,-1.793667 6.080531,-2.331767 0.197303,-0.01794 0.304923,-0.01794 0.26905,0 0.43048,0.43048 0.466354,1.309377 2.170337,4.735281 0.05381,0.10762 0.05381,0.179366 0,0.304924 -0.32286,0.304924 -0.143493,0 -0.48429,-0.05381 -0.340796,-0.05381 -0.520163,-0.05381 -1.29144,0 -2.26002,0.59191 -1.165884,0.681593 -1.165884,1.901287 0,1.094137 1.29144,2.6905 2.277957,2.869867 2.385577,3.013361 1.273504,1.973033 1.273504,3.9281301 z"
           style="font-style:normal;font-variant:normal;font-weight:bold;font-stretch:normal;font-family:BerlinSansFBDemi;-inkscape-font-specification:'BerlinSansFBDemi Bold'"
           id="path3349" />
        <path
           d="m 89.288908,-19.676526 q 0,0.358733 -0.394606,0.358733 -0.681594,0 -5.398938,-0.26905 -0.10762,4.537977 -0.10762,6.331644 0,2.116527 0.16143,6.367518 0.179367,4.2509906 0.179367,6.36751759 0,0.34079672 -0.16143,0.43048006 Q 83.513301,-0.05381001 83.064884,0 81.988684,0.14349335 79.90803,0.14349335 77.5942,0.14349335 76.661493,0 q -0.502227,-0.08968335 -0.502227,-0.55603675 0,-2.11652695 0.179367,-6.34958095 0.179367,-4.2330543 0.179367,-6.3495813 0,-1.39906 -0.143494,-6.241961 -3.587333,0.358734 -5.721797,0.358734 -0.286987,0 -0.286987,-0.179367 0,-0.233177 0.251114,-1.381123 0.286986,-1.255567 0.32286,-1.524617 0.05381,-0.843024 0.125556,-1.686047 0.125557,-1.34525 0.43048,-1.34525 0.03587,0 0.251114,0.01794 2.90574,0.37667 8.591664,0.37667 1.614301,0 5.954975,-0.340796 2.331767,-0.179367 2.349703,-0.179367 0.358734,0 0.412544,0.05381 0.05381,0.03587 0.07175,0.340797 0,0.48429 -0.03587,1.34525 -0.03587,0.950643 -0.03587,1.34525 0,0.448417 0.10762,1.327314 0.125556,0.86096 0.125556,1.29144 z"
           style="font-style:normal;font-variant:normal;font-weight:bold;font-stretch:normal;font-family:BerlinSansFBDemi;-inkscape-font-specification:'BerlinSansFBDemi Bold'"
           id="path3351" />
        <path
           d="m 109.57535,-5.5783041 q 0,0.7712767 -0.30492,2.8339937 -0.32286,2.24208366 -0.57397,2.67256372 -0.21524,0.34079672 -0.59191,0.34079672 -0.16143,0 -0.5381,-0.05381 -1.30938,-0.17936669 -7.641026,-0.17936669 -1.381124,0 -4.107497,-0.01793667 Q 93.091553,0 91.728366,0 q -0.59191,0 -0.59191,-0.52016341 0,-2.00890699 0.21524,-6.02672089 0.233177,-4.0357507 0.233177,-6.0446577 0,-2.04478 -0.21524,-7.623084 -0.05381,-1.434934 -0.197304,-4.286864 l -0.01794,-0.251114 q -0.03587,-0.412543 0.448416,-0.412543 1.327314,0 3.981941,0.07175 2.672564,0.07175 3.999877,0.07175 1.309373,0 3.946063,-0.07175 2.63669,-0.07175 3.94607,-0.07175 0.93271,0 1.0762,0.69953 0.0897,0.412543 0.26905,2.511134 0.19731,2.080653 0.19731,2.52907 0,0.37667 -0.35874,0.37667 -0.10762,0 -0.37667,-0.01794 -4.77115,-0.394607 -8.573726,-0.394607 -0.950643,0 -1.165884,0.448417 -0.08968,0.21524 -0.08968,1.381123 0,1.219694 0.358734,1.6143 0.304923,0.340797 1.165883,0.340797 0.179366,0 0.699526,-0.01794 0.52017,-0.03587 0.86096,-0.03587 2.26002,0 4.57385,-0.125557 0.19731,-0.01794 0.98652,-0.08968 0.60985,-0.07175 0.96858,-0.07175 0.43048,0 0.43048,0.412544 0,-0.37667 -0.32286,2.74431 -0.14349,1.434934 -0.14349,2.8698672 0,0.3587334 -0.52016,0.3587334 0,0 -1.61431,-0.1793667 -1.02239,-0.10762 -4.66353,-0.10762 l -1.901286,0 q -0.735404,0 -0.86096,0.3587334 -0.01794,0.089683 -0.01794,1.1120735 0,1.3631868 0.179367,1.7577936 0.304923,0.6815934 2.295896,0.8071501 -0.0359,0 2.61875,0 0.95064,0 2.81606,-0.1614301 1.88335,-0.1793666 2.81606,-0.1793666 0.3946,0 0.3946,0.6457201 z"
           style="font-style:normal;font-variant:normal;font-weight:bold;font-stretch:normal;font-family:BerlinSansFBDemi;-inkscape-font-specification:'BerlinSansFBDemi Bold'"
           id="path3353" />
        <path
           d="m 128.444,0.30492338 q -1.54255,0 -4.01781,-0.0717467 -3.2286,-0.0717467 -4.01782,-0.0896833 L 115.04531,0.07174668 Q 114.23816,0.08968335 112.73148,0 q -0.52016,-0.08968335 -0.52016,-0.55603675 0,-1.95509695 0.0538,-5.84735415 0.0717,-3.9101941 0.0717,-5.8652911 0,-2.080653 -0.12555,-6.224024 -0.12556,-4.161307 -0.12556,-6.241961 0,-0.394607 0.5381,-0.394607 0.5381,0 1.59636,0.05381 1.0762,0.05381 1.59637,0.05381 0.59191,0 1.75779,-0.05381 1.16588,-0.07175 1.75779,-0.07175 0.26905,0 0.25112,0.340796 l -0.0179,0.233177 q -0.21524,3.372094 -0.48429,10.134218 l -0.0179,4.7352809 q 0,2.2958937 0.0179,3.3541572 0.0179,0.21524 0.0359,0.43048 0.0179,0.2152401 0.26905,0.2690501 0.0179,0 0.46636,0 1.6143,0 4.82496,-0.16143 3.2286,-0.1793667 4.8429,-0.1793667 0.48429,0 0.48429,0.4125434 0,3.0671704 -0.44842,5.29131739 -0.0897,0.4663534 -0.37667,0.55603675 -0.0897,0.0358733 -0.7354,0.0358733 z"
           style="font-style:normal;font-variant:normal;font-weight:bold;font-stretch:normal;font-family:BerlinSansFBDemi;-inkscape-font-specification:'BerlinSansFBDemi Bold'"
           id="path3355" />
      </g>
    </g>
  </g>
</svg>
