{
  "streams": [
    {
      "title": "My Stream",
      "description": "awesome stream!",
      "userId": "114110936774040724592",
      "id": 1
    },
    {
      "title": "Other Stream",
      "description": "always good",
      "userId": "114110936775630723392",
      "id": 2
    },
    {
      "title": "My Changed Stream",
      "description": "my amazing stream",
      "id": 3
    }
  ]
}