╒═══════════╤═══════════════════════════╤══════════════════════════════════════════════════════════════════════════════╕
│    Day    │           Meal            │                                    To buy                                    │
╞═══════════╪═══════════════════════════╪══════════════════════════════════════════════════════════════════════════════╡
│  Monday   │         Carbonara         │           1x Bacon; 1x Cogumelos; 1x Molho Carbonara; 1x Spagueti            │
├───────────┼───────────────────────────┼──────────────────────────────────────────────────────────────────────────────┤
│  Tuesday  │          Lasanha          │                             1x Lasanha Congelada                             │
├───────────┼───────────────────────────┼──────────────────────────────────────────────────────────────────────────────┤
│ Wednesday │     Empadão de carne      │ 1x Carne Picada; 1x Molho de Tomate; 1x Puré; 1x Cogumelos; 1x Queijo Ralado │
├───────────┼───────────────────────────┼──────────────────────────────────────────────────────────────────────────────┤
│ Thrusday  │         Bolonhesa         │        1x Carne Picada; 1x Molho de Tomate; 1x Spagueti; 1x Cogumelos        │
├───────────┼───────────────────────────┼──────────────────────────────────────────────────────────────────────────────┤
│  Friday   │       Frango à Brás       │                     2x peito de Frango; 2x Batatas Pála                      │
├───────────┼───────────────────────────┼──────────────────────────────────────────────────────────────────────────────┤
│ Saturday  │ Omolete c/ Salada e Arroz │                3x Ovos; 1x Arroz; 1x Alface; 1x Tomate cherry                │
├───────────┼───────────────────────────┼──────────────────────────────────────────────────────────────────────────────┤
│  Sunday   │       Arroz c/ Atum       │                     2x Latas de Atum; 1x Arroz; 2x Ovos                      │
╘═══════════╧═══════════════════════════╧══════════════════════════════════════════════════════════════════════════════╛
