<svg width="458" height="476" viewBox="0 0 458 476" fill="none" xmlns="http://www.w3.org/2000/svg">
<g clip-path="url(#clip0)">
<path d="M415.703 255.737C418.955 267.058 433.532 276.482 450.863 271.504C468.194 266.525 468.006 251.152 467.486 250.866C467.16 250.687 465.763 264.339 450.097 268.839C438.735 272.103 422.297 268.592 418.383 254.967C415.064 243.415 423.184 226.179 431.058 223.918C438.939 221.654 451.327 225.783 454.676 237.444C458.026 249.105 447.562 257.999 441.374 259.777C434.117 261.861 427.552 256.982 425.993 251.557C423.855 244.114 428.352 236.603 434.979 234.699C441.605 232.796 446.558 236.788 447.832 241.225C449.04 245.43 445.447 251.125 439.985 252.694C436.483 253.7 433.392 253.865 432.625 251.193C431.66 247.833 435.232 244.181 437.507 243.527C439.782 242.874 442.084 244.042 442.587 245.794C443.09 247.545 441.747 249.119 441.747 249.119C442.425 249.492 444.279 246.414 443.566 243.934C443.125 242.4 441.208 239.572 436.74 240.856C431.751 242.289 428.998 248.665 429.944 251.956C430.889 255.248 434.807 257.059 440.748 255.352C446.69 253.646 452.481 247.312 450.51 240.449C448.536 233.579 441.379 229.968 434.204 232.03C426.892 234.13 420.425 242.296 423.305 252.321C425.238 259.048 433.352 264.958 442.131 262.437C451.82 259.653 460.752 248.522 457.347 236.67C454.406 226.433 442.838 217.641 430.284 221.248C420.518 224.053 412.271 243.79 415.703 255.737Z" fill="#10A6ED" fill-opacity="0.2"/>
<path d="M406.356 208.515C402.701 208.637 398.818 211.785 397.984 212.508C398.399 211.208 402.169 204.405 398.53 200.966C396.275 198.836 391.928 197.969 387.847 202.288C383.842 206.526 386.054 212.326 386.764 213.667C385.298 212.845 382.242 210.952 378.687 211.13C376.552 211.236 374.145 212.212 372.13 214.344C370.484 216.086 370.044 219.486 372.423 221.734C375.152 224.313 380.368 224.681 380.677 224.705C380.677 224.705 378.252 226.019 376.572 227.797C373.35 231.206 374.398 236.566 377.292 239.301C380.381 242.22 385.014 241.253 388.522 237.54C390.541 235.404 391.191 232.633 391.392 231.79C391.583 232.248 393.399 235.474 395.358 237.326C398.257 240.065 402.994 239.598 405.3 237.158C408.001 234.299 407.892 229.759 404.623 226.67C403.518 225.626 402.187 224.702 401.833 224.445C402.19 224.448 407.64 224.549 411.101 220.887C414.652 217.129 414.383 213.107 411.519 210.401C409.84 208.833 408.017 208.459 406.356 208.515ZM395.612 216.96C398.127 219.336 397.328 222.234 395.457 224.214C392.474 227.371 388.492 226.027 386.957 224.577C384.658 222.405 386.666 218.928 387.687 217.847C390.346 215.043 394.123 215.552 395.612 216.96ZM389.319 214.378C388.72 213.249 385.987 207.53 389.434 203.883C392.407 200.736 395.516 201.082 397.045 202.527C398.305 203.717 398.174 205.669 397.697 207.465C396.993 210.242 395.247 213.182 395.119 214.238C392.917 213.074 389.319 214.378 389.319 214.378ZM386.663 216.037C383.494 219.23 383.81 222.521 383.823 222.697C383.823 222.697 376.923 222.84 374.018 220.096C372.789 218.934 372.709 216.956 373.897 215.698C379.057 210.228 385.174 215.3 386.663 216.037ZM378.199 229.019C380.19 226.912 382.686 226.173 384.458 224.788C386.085 227.673 389.755 228.235 389.878 228.255C389.764 229.487 388.994 233.807 386.87 236.055C384.745 238.303 381.208 239.923 378.729 237.58C376.915 235.865 375.502 231.873 378.199 229.019ZM391.881 228.408C395.006 228.186 397.17 225.996 398.136 224.423C398.136 224.423 401.342 226.668 403.311 228.529C405.286 230.394 405.483 233.66 403.679 235.569C401.865 237.489 398.629 237.549 396.735 235.758C393.926 233.104 393.262 230.602 392.462 229.406C392.232 228.969 391.896 228.422 391.881 228.408ZM398.977 222.692C399.118 222.242 400.414 218.457 397.515 215.718C398.238 215.033 403.12 210.868 406.085 210.774C407.541 210.725 408.665 210.888 409.925 212.078C410.374 212.503 413.442 215.354 409.609 219.411C407.991 221.123 405.986 221.973 404.032 222.239C402.399 222.455 400.973 222.322 398.977 222.692Z" fill="#10A6ED" fill-opacity="0.2"/>
<path d="M352.825 255.344C353.184 255.807 353.383 256.404 353.243 256.775C353.25 256.87 353.232 257.006 353.204 257.056C353.141 257.377 352.401 257.817 351.598 257.917C350.802 258.042 349.921 257.944 349.337 257.629C348.812 257.373 348.423 256.705 348.44 256.101C348.44 255.487 348.812 254.918 349.416 254.614L349.477 254.583C350.036 254.319 350.744 254.308 351.344 254.556L352.825 255.344ZM398.3 280.66C398.159 280.735 398.185 280.728 398.179 280.73L398.166 280.733C398.146 280.739 398.134 280.722 398.137 280.707C398.142 280.699 398.14 280.692 398.146 280.691L398.158 280.68C398.187 280.637 398.275 280.502 398.342 280.414C398.637 280.019 399.01 279.622 399.394 279.243C400.005 278.647 400.678 278.095 401.378 277.563C400.65 278.586 399.821 279.527 398.908 280.251C398.704 280.399 398.498 280.541 398.3 280.66ZM379.027 268.775C378.985 270.47 378.141 272.022 376.695 272.851C376.198 273.159 375.733 273.403 375.301 273.617C374.945 273.678 374.558 273.83 374.091 273.847C373.968 273.862 373.839 273.878 373.708 273.888C373.466 273.93 373.21 273.921 372.957 273.925C372.784 273.933 372.595 273.939 372.413 273.943C371.117 273.799 369.882 273.229 369.047 272.359C368.813 272.158 368.363 271.722 368.211 271.462C367.676 270.754 367.405 269.86 367.367 269.016C367.322 268.27 367.702 267.334 368.16 266.499C369.11 264.827 370.565 263.264 372.185 262.475C372.387 262.369 372.586 262.325 372.787 262.24C372.985 262.218 373.173 262.136 373.371 262.141C373.75 262.108 374.235 262.155 374.599 262.243C375.392 262.477 376.174 262.991 376.832 263.636C377.97 264.777 378.781 266.323 378.983 267.885L379.027 268.775ZM375.27 295.445C374.876 295.841 374.482 296.189 374.086 296.551L373.644 296.926L373.357 297.153C373.161 297.306 372.97 297.45 372.773 297.597C372.376 297.883 371.963 298.14 371.546 298.383C370.71 298.858 369.827 299.243 368.918 299.49C368.011 299.744 367.071 299.855 366.126 299.83C365.251 299.826 364.331 299.594 363.401 299.275C360.897 298.409 358.5 296.788 357.341 294.522C356.758 293.4 356.486 292.134 356.566 290.843C356.547 290.531 356.618 290.187 356.655 289.852L356.788 288.842C356.946 288.19 357.073 287.526 357.287 286.899C358.116 284.386 359.64 282.183 361.616 280.671C363.554 279.101 365.85 278.186 368.019 277.687C369.961 277.26 371.284 277.204 372.007 277.142C372.129 277.127 372.231 277.112 372.325 277.098L372.454 277.302C372.635 277.588 372.816 277.874 373.015 278.148C373.394 278.708 373.8 279.239 374.19 279.761C374.987 280.794 375.767 281.742 376.426 282.539C378.221 284.739 380.133 286.906 382.024 289.121C383.926 291.325 385.769 293.595 387.621 295.896C389.472 298.191 391.319 300.501 393.23 302.737C393.618 303.177 394.005 303.617 394.392 304.058C394.393 304.085 394.4 304.11 394.422 304.187C394.493 304.435 394.568 304.696 394.656 305.002C394.908 305.977 395.677 308.163 396.01 310.597C396.092 311.201 396.12 311.813 396.074 312.392C396.027 312.964 395.869 313.568 395.694 314.135C395.317 315.277 394.755 316.314 394.169 317.096C392.614 319.287 390.135 320.792 387.405 320.907C384.672 321.059 381.945 319.96 379.904 318.105C377.828 316.275 376.496 313.7 375.918 311.026C375.657 309.674 375.51 308.303 375.6 306.926C375.622 305.554 375.875 304.227 376.237 302.91C376.5 301.959 376.828 301.016 377.199 300.076L377.493 299.357L378.111 297.925C378.518 296.987 379.011 295.929 379.066 295.313C379.109 294.997 379.077 294.786 379.026 294.608C378.96 294.454 378.885 294.338 378.8 294.19C378.758 294.119 378.715 294.042 378.61 293.969C378.589 293.947 378.556 293.929 378.527 293.903L378.517 293.892C378.501 293.911 378.545 293.843 378.479 293.931L378.47 293.926L378.445 293.913L378.395 293.886L378.252 293.803C378.118 293.731 378.036 293.665 377.898 293.65C377.636 293.621 377.22 293.623 376.449 294.3C376.081 294.613 375.658 295.079 375.27 295.445ZM384.028 257.136C384.701 255.943 385.591 254.798 386.667 254.027C387.744 253.262 388.967 252.883 390.03 252.805C390.755 252.728 391.507 252.795 392.276 252.919C392.66 252.981 393.044 253.015 393.419 253.094L394.526 253.417L395.079 253.575L395.605 253.81L396.656 254.28L397.63 254.897C397.787 255.003 397.961 255.091 398.115 255.212L398.56 255.581C399.783 256.526 400.773 257.765 401.605 259.091C402.45 260.413 403.084 261.885 403.562 263.403C404.039 264.913 404.361 266.503 404.446 268.05C404.481 268.44 404.467 268.81 404.453 269.179C404.427 269.552 404.388 269.956 404.327 270.332C404.21 271.103 404.042 271.869 403.811 272.611C403.717 272.92 403.606 273.221 403.495 273.522C402.016 274.36 400.615 275.321 399.292 276.384C398.618 276.936 397.969 277.522 397.355 278.181C397.046 278.504 396.753 278.857 396.475 279.24L396.256 279.558C396.157 279.704 396.077 279.892 395.992 280.062C395.9 280.233 395.823 280.407 395.789 280.582C395.74 280.754 395.678 280.931 395.691 281.099C395.619 281.782 396.024 282.403 396.554 282.803C397.123 283.163 397.852 283.174 398.572 282.885C399.414 282.553 399.668 282.308 400.074 282.026C400.451 281.745 400.793 281.44 401.119 281.126C402.405 279.86 403.425 278.43 404.261 276.9C404.563 276.331 404.839 275.748 405.086 275.16C406.998 274.136 410.261 272.736 413.009 272.905C415.757 273.074 421.916 274.662 421.321 282.506C420.442 293.996 413.152 298.772 406.256 298.347C405.992 298.333 405.76 298.289 405.528 298.266C405.421 298.263 405.282 298.22 405.259 298.213C405.253 298.215 405.24 298.218 405.225 298.216C405.101 297.982 404.978 297.749 404.854 297.515C403.85 295.687 402.77 293.916 401.645 292.184C398.531 287.426 395.008 282.647 391.369 278.273C389.55 276.087 387.698 274.006 385.8 272.111C384.845 271.165 383.889 270.267 382.873 269.456C382.624 269.252 382.362 269.051 382.102 268.857L381.703 268.572L380.894 268.087C381.048 266.071 382.507 259.765 384.028 257.136ZM385.369 289.945C384.597 289.023 383.817 288.102 383.021 287.193L382.611 286.725C380.832 284.678 379.029 282.646 377.314 280.553C376.464 279.508 375.637 278.443 374.881 277.357C374.704 277.084 374.499 276.812 374.334 276.535L373.934 275.878C373.932 275.871 373.937 275.863 373.947 275.874L373.945 275.868C373.939 275.869 373.952 275.866 373.937 275.863L373.924 275.867L374.04 275.854L374.271 275.822C374.877 275.772 375.458 275.564 376.013 275.411C376.362 275.277 376.685 275.122 376.995 274.95C377.414 274.768 377.914 274.493 378.393 274.101C379.249 273.427 379.951 272.433 380.314 271.66C380.526 271.247 380.681 270.803 380.799 270.355C381.185 270.644 381.565 270.962 381.934 271.291C383.43 272.619 384.815 274.103 386.144 275.638C386.835 276.377 388.182 277.9 388.842 278.676C392.705 283.219 396.248 287.944 399.433 292.799C401.013 295.234 402.506 297.707 403.781 300.257C404.415 301.53 404.998 302.824 405.435 304.125C405.65 304.774 405.832 305.432 405.936 306.064C406.038 306.689 406.06 307.331 405.922 307.757C405.864 307.973 405.76 308.127 405.664 308.21C405.623 308.263 405.463 308.344 405.378 308.416C405.272 308.488 405.148 308.524 405.04 308.589C404.588 308.781 404.067 308.786 403.502 308.659C402.362 308.393 401.198 307.604 400.128 306.753C397.982 304.998 396.07 302.831 394.198 300.659C391.231 297.175 388.37 293.523 385.369 289.945ZM415.776 284.009C417.707 284.13 419.381 282.939 419.536 280.903C419.692 278.872 418.362 275.835 416.036 275.689C413.662 275.544 411.921 278.54 411.792 280.225C411.663 281.909 413.852 283.887 415.776 284.009ZM413.648 280.353C413.754 278.958 415.025 277.593 415.966 277.654C416.907 277.714 417.596 279.647 417.503 280.894C417.408 282.134 416.124 282.179 415.888 282.164C415.177 282.12 413.569 281.355 413.648 280.353ZM390.832 261.558C392.547 261.665 394.119 260.979 394.335 258.125C394.471 256.314 394.038 254.122 391.081 253.937C388.965 253.808 387.41 255.978 387.292 257.48C387.179 258.974 388.414 261.411 390.832 261.558ZM389.333 257.321C389.426 256.075 390.448 255.733 391.289 255.788C392.594 255.867 392.687 257.268 392.603 258.375C392.519 259.481 391.356 259.532 391.148 259.516C390.516 259.477 389.207 258.943 389.333 257.321ZM398.532 270.011C398.678 268.115 397.292 265.645 395.225 265.515C393.158 265.385 391.555 266.873 391.381 269.163C391.205 271.495 393.852 273.396 395.561 273.505C397.654 273.628 398.372 272.077 398.532 270.011ZM395.608 271.534C394.187 271.446 393.347 270.019 393.42 269.095C393.493 268.17 393.86 267.265 395.129 267.342C396.702 267.442 396.69 270.175 396.674 270.414C396.619 271.105 396.361 271.579 395.608 271.534ZM410.974 288.664C411.131 286.585 409.871 284.506 407.653 284.364C405.585 284.234 403.036 286.056 402.862 288.347C402.686 290.679 404.62 292.357 406.329 292.466C409.07 292.637 410.797 290.969 410.974 288.664ZM406.541 290.702C405.53 290.641 404.625 289.75 404.696 288.819C404.813 287.31 406.141 286.267 407.541 286.354C408.682 286.426 409.122 287.81 409.049 288.782C408.976 289.755 408.013 290.796 406.541 290.702ZM389.081 314.766C389.238 312.687 388.048 310.754 385.829 310.612C383.762 310.482 381.644 312.628 381.468 314.912C381.292 317.245 382.933 318.98 384.641 319.089C387.376 319.261 388.904 317.071 389.081 314.766ZM384.817 316.901C383.805 316.84 383.466 315.759 383.539 314.834C383.656 313.326 384.487 312.466 385.887 312.554C387.028 312.626 386.966 313.636 386.893 314.609C386.811 315.577 386.282 316.997 384.817 316.901ZM386.949 303.273C387.106 301.194 385.916 299.26 383.698 299.119C381.63 298.989 380.356 300.809 380.182 303.1C380.007 305.432 381.971 306.406 382.905 306.468C385.416 306.622 386.772 305.578 386.949 303.273ZM383.531 304.82C382.52 304.759 382.1 303.983 382.172 303.059C382.289 301.55 383.3 301.095 383.852 301.129C384.405 301.163 385.19 302.082 385.115 303.048C385.042 304.02 384.766 304.899 383.531 304.82ZM362.116 293.157C364.047 293.278 365.72 292.087 365.875 290.051C366.032 288.02 364.701 284.983 362.376 284.837C360.001 284.692 358.261 287.688 358.132 289.373C357.996 291.059 360.187 293.043 362.116 293.157ZM359.981 289.503C360.087 288.108 361.359 286.743 362.299 286.803C363.24 286.864 363.929 288.796 363.836 290.043C363.742 291.284 362.458 291.329 362.221 291.314C361.51 291.27 359.904 290.511 359.981 289.503ZM375.615 289.507C375.772 287.428 374.207 285.734 371.988 285.592C369.921 285.462 367.662 287.29 367.486 289.574C367.311 291.906 369.148 293.274 372.112 293.457C374.373 293.6 375.5 290.995 375.615 289.507ZM371.388 291.673C370.377 291.612 369.422 290.597 369.483 289.8C369.581 288.524 370.767 287.501 372.167 287.588C372.978 287.638 373.846 288.305 373.771 289.271C373.685 290.248 373.231 291.784 371.388 291.673ZM360.645 245.542C360.476 244.929 360.587 244.235 360.929 243.73L360.968 243.671C361.36 243.124 361.984 242.841 362.601 242.926C363.211 242.992 363.833 243.461 364.018 244.008C364.258 244.622 364.234 245.497 363.999 246.247C363.79 247.017 363.238 247.672 362.912 247.69C362.855 247.713 362.712 247.706 362.623 247.69C362.231 247.775 361.659 247.498 361.242 247.08L360.645 245.542ZM371.426 260.425L363.606 249.738C363.632 249.731 363.666 249.728 363.692 249.72C364.474 249.447 365.01 248.886 365.368 248.363C365.734 247.824 365.969 247.267 366.15 246.718C366.397 245.91 366.492 245.062 366.374 244.186C366.303 243.744 366.175 243.299 365.951 242.86C365.719 242.423 365.346 242.006 364.987 241.737C363.967 240.934 362.406 240.604 361.095 241.145C359.774 241.649 358.925 242.865 358.725 244.032C358.634 244.452 358.549 245.041 358.596 245.572C358.602 245.667 358.61 246.43 358.735 246.89C359.066 248.14 360.205 249.433 361.013 250.503C361.922 251.704 368.517 259.792 369.748 261.403C369.708 261.435 369.659 261.463 369.619 261.495C368.935 262.009 368.335 262.595 367.804 263.223C367.274 263.831 366.959 264.452 366.959 264.452C365.5 263.03 357.376 256.636 356.286 255.591C355.32 254.655 354.182 253.369 352.961 252.872C352.514 252.69 351.741 252.574 351.652 252.559C351.123 252.435 350.517 252.436 350.083 252.471C348.881 252.507 347.539 253.161 346.846 254.38C346.126 255.58 346.237 257.141 346.908 258.251C347.124 258.637 347.493 259.061 347.905 259.343C348.316 259.618 348.751 259.81 349.184 259.941C350.056 260.18 350.917 260.208 351.767 260.074C352.351 259.975 352.941 259.82 353.53 259.54C354.106 259.264 354.747 258.819 355.126 258.103C355.14 258.078 355.146 258.049 355.16 258.024L365.872 266.239C365.514 267.004 365.286 267.683 365.179 268.686C365.147 269.998 365.477 271.193 366.103 272.268C366.718 273.332 367.631 274.152 368.583 274.719L370.331 275.479C365.942 275.83 361.41 277.4 358.014 281.161C357.196 281.968 356.102 283.951 355.663 284.973C355.398 285.746 355.058 286.498 354.906 287.294C354.814 287.685 354.715 288.079 354.63 288.469L354.478 289.657C354.268 291.234 354.347 293.004 354.959 294.572C355.561 296.15 356.602 297.519 357.841 298.591C359.079 299.662 360.493 300.462 361.977 301.063C362.715 301.375 363.491 301.6 364.28 301.794C364.684 301.878 365.094 301.954 365.55 301.995C365.972 302.018 366.378 302.033 366.788 302.012C368.436 301.959 370.079 301.542 371.552 300.857C372.292 300.513 372.988 300.113 373.65 299.668C373.981 299.449 374.301 299.212 374.612 298.971C374.895 298.752 375.345 298.381 375.254 298.456C375.316 298.403 375.37 298.347 375.431 298.288L375.519 298.201C375.536 298.189 375.552 298.17 375.572 298.165C375.6 298.163 375.594 298.193 375.593 298.214C375.574 298.295 373.798 302.245 373.5 306.116C372.852 314.582 378.176 322.394 386.257 322.899C394.339 323.404 397.841 315.524 398.074 312.41C398.253 310.111 397.486 307.588 397.365 307.168C398.042 307.807 398.743 308.433 399.501 309.008C400.385 309.658 401.347 310.284 402.542 310.665C403.134 310.86 403.81 310.956 404.505 310.921C405.211 310.877 405.916 310.633 406.52 310.281L406.958 309.989C407.104 309.885 407.277 309.704 407.424 309.552C407.688 309.221 407.894 308.858 408.01 308.501C408.25 307.791 408.267 307.138 408.235 306.534C408.15 305.331 407.841 304.282 407.498 303.257C407.135 302.217 406.713 301.214 406.25 300.238C414.847 300.774 422.577 294.727 423.491 282.772C424.25 272.923 416.318 270.927 413.16 270.731C410.003 270.535 406.816 271.933 406.056 272.255C406.07 272.182 406.099 272.112 406.114 272.039C406.307 271.19 406.447 270.33 406.515 269.462C407.125 261.476 401.668 251.51 391.232 250.854C390.793 250.849 390.356 250.823 389.91 250.889L389.245 250.956L388.581 251.098C386.802 251.479 385.194 252.533 383.983 253.812C382.794 255.119 381.943 256.625 381.301 258.167C380.394 260.434 380.035 262.495 379.857 264.256C379.364 263.398 378.754 262.601 378.028 261.913C377.152 261.096 376.099 260.399 374.795 260.105C374.559 260.042 374.325 260.013 374.105 260.007C373.879 259.982 373.646 259.98 373.395 259.99C373.147 259.986 372.904 260 372.666 260.055C372.426 260.103 372.176 260.14 371.962 260.229C371.773 260.284 371.603 260.353 371.426 260.425Z" fill="#10A6ED" fill-opacity="0.2"/>
<path d="M365.597 407.122C365.777 407.607 366.069 408.033 366.421 408.385C367.124 409.105 368.171 409.488 369.172 409.382C369.412 409.341 369.667 409.31 369.886 409.219L370.223 409.094L370.45 408.987C370.738 408.855 371.031 408.715 371.319 408.584C372.468 408.044 373.593 407.519 374.699 406.998C375.238 406.746 375.764 406.497 376.29 406.248C376.542 406.134 376.847 406.13 377.108 406.237C377.239 406.29 377.361 406.36 377.457 406.458C377.457 406.458 381.078 410.485 381.883 411.398C382.689 412.312 383.908 412.987 385.39 412.499C388.078 411.622 387.504 408.395 387.477 408.04C387.433 407.061 387.167 404.883 386.854 402.467C386.834 402.326 386.818 402.177 386.798 402.036C386.784 401.942 386.785 401.851 386.793 401.759C386.807 401.573 386.865 401.396 386.953 401.231C387.044 401.072 387.163 400.919 387.309 400.815C387.379 400.752 387.455 400.71 387.54 400.672C387.67 400.606 387.803 400.547 387.933 400.482C389.01 399.977 390.026 399.496 390.892 399.108C391.489 398.846 392.09 398.575 392.693 398.312L393.608 397.902C394.017 397.694 394.423 397.431 394.724 397.037C395.35 396.285 395.582 395.227 395.376 394.274C395.197 393.32 394.544 392.391 393.639 391.96C393.42 391.835 393.19 391.768 392.954 391.703C392.821 391.665 392.763 391.653 392.677 391.636L392.43 391.582L391.43 391.359C390.764 391.216 390.096 391.066 389.43 390.922L387.424 390.486L386.417 390.266C386.317 390.246 386.3 390.236 386.249 390.223C386.21 390.206 386.161 390.2 386.12 390.176C386.036 390.145 385.961 390.096 385.885 390.042C385.739 389.937 385.616 389.791 385.536 389.632C385.493 389.554 385.461 389.465 385.437 389.382C385.411 389.291 385.409 389.236 385.383 389.027L385.136 386.941C384.974 385.55 384.816 384.171 384.651 382.795C384.619 382.518 384.559 381.928 384.349 381.458C384.143 380.979 383.836 380.523 383.431 380.2C382.644 379.518 381.598 379.232 380.605 379.413C379.606 379.553 378.684 380.314 378.256 381.142C377.928 381.725 377.606 382.306 377.283 382.88C376.811 383.721 376.348 384.566 375.883 385.404L375.186 386.665L375.016 386.973C374.988 387.016 374.961 387.065 374.925 387.103C374.86 387.185 374.779 387.257 374.692 387.31C374.514 387.424 374.306 387.477 374.097 387.46C374.068 387.454 374.043 387.461 374.019 387.447C373.99 387.442 373.984 387.444 373.912 387.429L373.564 387.355L372.863 387.207L370.06 386.616L368.66 386.328L367.959 386.18L367.602 386.122L367.422 386.083L367.154 386.048C366.439 385.946 365.647 386.097 365.006 386.491C364.364 386.878 363.874 387.465 363.588 388.147C363.3 388.823 363.222 389.614 363.399 390.373C363.44 390.563 363.511 390.738 363.577 390.922C363.648 391.097 363.748 391.256 363.837 391.426C363.931 391.588 364.053 391.727 364.162 391.87L364.247 391.979L364.309 392.052L364.429 392.185L366.395 394.328C366.849 394.819 367.302 395.31 367.757 395.807L368.44 396.554L368.786 396.929C368.855 397.007 368.849 397.008 368.887 397.046C368.911 397.081 368.939 397.108 368.956 397.145C369.129 397.417 369.171 397.775 369.068 398.076C369.052 398.116 369.042 398.154 369.025 398.187L369 398.242L368.943 398.35L368.704 398.795L368.22 399.688C367.571 400.879 366.927 402.063 366.282 403.246L365.803 404.131C365.586 404.556 365.397 405.057 365.373 405.587C365.339 405.848 365.374 406.111 365.396 406.376C365.448 406.627 365.489 406.887 365.597 407.122ZM367.852 405.308C368.517 404.077 369.182 402.846 369.842 401.623L370.836 399.788L370.96 399.557C370.999 399.483 371.041 399.415 371.104 399.278C371.219 399.043 371.31 398.793 371.365 398.533C371.481 398.018 371.481 397.474 371.36 396.957C371.245 396.439 371.003 395.95 370.673 395.535L370.548 395.383L370.456 395.276L370.279 395.083L369.929 394.695L368.528 393.15L367.129 391.611L366.433 390.841L366.085 390.459C365.939 390.306 365.936 390.272 365.867 390.194C365.682 389.905 365.629 389.578 365.733 389.234C365.84 388.897 366.1 388.619 366.395 388.514C366.544 388.464 366.698 388.434 366.884 388.464C366.935 388.477 366.952 388.465 367.038 388.483L367.285 388.537L367.782 388.639L369.768 389.052L371.754 389.466L372.743 389.671L373.24 389.772L373.487 389.827C373.58 389.842 373.724 389.871 373.843 389.885C374.854 390 375.883 389.613 376.579 388.869C376.751 388.687 376.909 388.481 377.035 388.256C377.107 388.131 377.134 388.081 377.178 387.999L377.297 387.776L377.781 386.883L379.718 383.298L380.201 382.405C380.292 382.225 380.337 382.191 380.385 382.101C380.44 382.029 380.497 381.971 380.557 381.919C380.675 381.808 380.828 381.75 380.983 381.699C381.148 381.658 381.321 381.671 381.498 381.697C381.673 381.738 381.825 381.82 381.969 381.918C382.102 382.026 382.193 382.154 382.277 382.304C382.295 382.39 382.355 382.456 382.355 382.554C382.362 382.601 382.375 382.646 382.388 382.691L382.419 382.94L382.544 383.966C382.713 385.334 382.875 386.704 383.045 388.072L383.169 389.098C383.196 389.285 383.201 389.396 383.251 389.688C383.302 389.939 383.375 390.19 383.478 390.433C383.883 391.392 384.735 392.138 385.722 392.406C387.068 392.696 388.414 392.987 389.767 393.275L391.762 393.7C392.073 393.764 392.5 393.858 392.6 393.899C392.672 393.934 393.064 394.024 393.246 394.586C393.471 395.275 393.025 395.683 393.025 395.683L392.845 395.839L392.622 395.959C392.622 395.959 390.33 397.008 389.178 397.535C388.601 397.798 388.025 398.061 387.449 398.324L386.551 398.743C386.111 398.96 385.721 399.281 385.412 399.67C385.103 400.059 384.874 400.516 384.758 401.01C384.692 401.252 384.663 401.505 384.654 401.759C384.656 401.884 384.652 402.011 384.662 402.14C384.662 402.14 385.285 407.95 385.406 408.962C385.526 409.968 385.032 410.305 384.672 410.423C384.002 410.643 383.618 410.132 383.258 409.733C382.899 409.334 379.037 405.012 379.037 405.012C378.57 404.497 377.941 404.127 377.265 403.993C376.599 403.849 375.848 403.953 375.267 404.225C374.832 404.413 374.397 404.6 373.964 404.795C373.099 405.162 372.227 405.531 371.339 405.912C370.908 406.112 370.262 406.417 369.614 406.714L369.374 406.825L369.255 406.88L369.186 406.9C369.142 406.913 369.1 406.932 369.064 406.949C369.024 406.954 368.985 406.958 368.947 406.969C368.868 406.999 368.798 406.97 368.734 406.981C368.67 406.972 368.606 406.962 368.555 406.949C368.245 406.863 367.933 406.604 367.799 406.28C367.656 405.972 367.672 405.674 367.852 405.308Z" fill="#10A6ED" fill-opacity="0.2"/>
<path d="M427.385 442.974C421.652 441.349 417.776 435.23 413.302 431.594C409.43 428.443 404.899 425.706 399.857 425.059C394.541 424.38 389.795 426.454 385.183 428.903C382.14 430.517 378.563 432.476 374.979 433.139C375.807 432.217 376.397 431.016 376.585 429.637C376.891 427.357 374.988 425.697 372.745 426.211C370.873 426.637 369.196 428.252 367.874 429.938C368.002 426.053 366.747 421.975 365.173 418.569C360.568 408.579 351.436 402.259 340.209 403.361C330.188 404.343 321.284 411.508 319.424 421.621C317.193 433.755 325.8 444.74 337.03 448.22C337.089 448.242 337.147 448.245 337.205 448.258C337.259 448.276 337.314 448.303 337.368 448.32C346.309 450.706 355.969 446.658 362.46 440.42C363.305 439.605 364.133 438.725 364.883 437.782C364.963 439.264 365.283 440.725 365.974 442.063C366.922 443.901 369.015 446.152 371.289 445.079C373.993 443.801 373.873 440.043 373.095 437.655C372.905 437.064 372.649 436.532 372.341 436.034C380.815 436.145 388.726 427.665 397.427 427.579C403.58 427.514 408.981 431.252 413.394 435.174C417.719 439.017 421.192 443.97 426.989 445.611C428.627 446.071 429.01 443.44 427.385 442.974ZM370.794 430.716C371.205 430.29 373.981 427.627 373.842 429.732C373.711 431.732 371.258 433.186 369.634 432.051C369.994 431.593 370.379 431.147 370.794 430.716ZM361.645 437.495C355.791 443.843 346.436 447.938 337.897 445.721C329.091 442.903 321.917 435.392 321.734 425.758C321.547 416.171 328.873 408.26 338.039 406.375C347.929 404.343 356.846 408.892 361.696 417.548C363.765 421.242 365.32 425.69 365.201 429.977C365.114 432.984 363.642 435.322 361.645 437.495ZM370.534 438.352C370.931 439.42 371.442 443.328 369.513 442.36C367.449 441.325 367.355 437.95 367.611 435.561C368.985 435.988 369.998 436.907 370.534 438.352Z" fill="#10A6ED" fill-opacity="0.2"/>
<path d="M270.044 303.52C270.209 303.243 270.365 302.93 270.521 302.616C270.474 302.668 269.481 304.449 270.044 303.52Z" fill="#10A6ED" fill-opacity="0.2"/>
<path d="M478.828 319.407C478.107 319.087 477.493 319.407 476.823 319.72C476.109 320.06 475.42 320.462 474.755 320.894C473.49 321.724 472.21 322.656 471.222 323.813C469.197 326.172 467.965 329.228 467.422 332.253C467.098 334.055 466.998 335.928 467.03 337.756C465.391 336.224 463.836 334.616 462.444 332.862C461.046 331.088 459.914 329.207 458.884 327.207C460.071 328.063 461.501 329 463.049 328.758C464.545 328.524 465.878 327.615 466.706 326.375C467.491 325.201 467.831 323.741 467.496 322.362C467.139 320.883 466.395 319.403 465.49 318.18C464.456 316.775 463.009 315.806 461.578 314.839C463.755 314.966 465.913 315.348 468.06 314.761C469.122 314.471 470.273 314.17 471.209 313.57C472.183 312.944 472.902 312.068 473.475 311.075C474.015 310.129 474.277 309.113 474.016 308.044C473.744 306.94 473.282 305.86 472.615 304.938C471.378 303.222 469.301 302.148 467.239 301.784C465.943 301.554 464.619 301.49 463.317 301.714C461.987 301.945 460.675 302.397 459.393 302.796C461.15 301.169 462.933 299.505 464.38 297.591C465.044 296.708 465.662 295.74 465.952 294.663C466.259 293.513 466.039 292.455 465.504 291.411C464.587 289.619 462.132 288.472 460.161 288.481C458.971 288.485 457.774 288.941 456.696 289.417C455.639 289.886 454.669 290.473 453.816 291.253C451.834 293.049 450.516 295.355 449.809 297.915C448.575 293.963 447.233 289.078 442.47 288.271C440.507 287.939 438.265 288.771 437.007 290.337C435.749 291.903 435.268 294.164 435.664 296.098C435.9 297.265 436.288 298.456 436.829 299.52C437.37 300.585 438.175 301.513 439.029 302.344C437.19 301.992 435.194 301.677 433.325 301.988C431.545 302.288 429.477 302.86 428.073 304.046C426.723 305.187 425.888 306.985 426.376 308.734C426.849 310.435 427.933 311.961 429.23 313.147C430.815 314.596 432.814 315.4 434.945 315.684C433.174 316.652 431.682 317.984 430.52 319.567C430.019 320.253 429.534 321.13 429.321 321.997C429.084 322.969 429.34 323.889 429.652 324.816C429.969 325.733 430.402 326.58 431.057 327.303C431.684 328.004 432.518 328.427 433.385 328.75C435.306 329.463 437.24 328.877 439.041 328.066C441.224 327.078 442.888 325.553 444.348 323.688C444.1 325.386 443.957 327.083 444.284 328.773C444.588 330.335 445.128 332.084 446.196 333.291C447.24 334.467 448.82 334.736 450.3 334.34C451.956 333.895 453.571 333.31 454.945 332.253C456.314 331.205 457.149 329.384 456.875 327.663C457.949 329.711 459.029 331.675 460.445 333.512C461.825 335.306 463.339 336.956 464.97 338.536C463.135 338.649 461.379 339.116 459.617 339.614C457.889 340.096 456.31 340.73 454.776 341.652C453.294 342.545 451.857 343.537 450.586 344.716C449.308 345.896 448.163 347.271 447.136 348.665C447.186 348.598 447.235 348.532 447.284 348.465C446.894 348.983 446.334 349.543 446.429 350.246C446.54 351.08 447.564 351.449 448.269 351.63C450.053 352.081 452.619 351.766 455.171 351.033C462.21 349.01 466.492 342.804 467.874 341.195C468.902 342.134 469.946 343.046 470.997 343.957C471.51 344.396 472.022 344.829 472.552 345.249C473.023 345.618 473.546 345.987 474.126 345.55C475.368 344.613 473.556 343.538 472.926 343.011C471.824 342.078 470.189 340.748 469.127 339.773C469.127 339.773 474.119 335.644 477.919 328.846C479.483 326.123 480.431 323.321 479.77 321.019C479.654 320.457 479.4 319.68 478.83 319.414C478.835 319.405 478.835 319.405 478.828 319.407ZM460.245 304.599C461.641 304.175 463.113 303.617 464.581 303.549C465.98 303.478 467.516 303.7 468.775 304.332C470.052 304.974 471.053 305.868 471.652 307.187C471.902 307.74 472.222 308.484 472.146 309.093C472.07 309.724 471.661 310.361 471.281 310.862C470.386 312.053 469.035 312.448 467.664 312.827C466.355 313.188 465.004 313.185 463.665 313.042C462.278 312.891 460.861 312.846 459.471 312.658C458.808 312.57 458.147 312.489 457.484 312.424C457.304 312.408 456.502 312.442 456.399 312.321C456.318 312.224 456.45 311.388 456.455 311.221C456.45 310.357 456.345 309.491 456.161 308.64C456.086 308.271 455.996 307.905 455.899 307.541C455.854 307.358 455.802 307.178 455.75 306.997C455.728 306.92 455.543 306.514 455.569 306.446C455.619 306.304 456.436 306.054 456.591 305.987C456.942 305.834 457.301 305.685 457.654 305.539C458.493 305.185 459.331 304.877 460.205 304.618C459.974 304.684 460.086 304.652 460.245 304.599ZM451.386 302.559C451.392 302.369 451.373 302.171 451.37 301.976C451.372 302.036 451.372 302.088 451.372 301.953C451.375 301.832 451.371 301.871 451.375 301.937C451.352 299.271 451.981 296.546 453.637 294.383C454.448 293.322 455.368 292.403 456.52 291.711C457.575 291.076 459.003 290.448 460.26 290.463C461.411 290.479 462.946 291.122 463.615 292.074C464.417 293.229 464.115 294.37 463.437 295.498C462.019 297.855 459.758 299.785 457.756 301.64C457.21 302.143 456.639 302.616 456.069 303.088C455.744 303.355 455.429 303.633 455.107 303.914C454.975 304.035 454.47 304.601 454.311 304.602C454.242 304.599 453.955 304.29 453.888 304.242C453.73 304.114 453.567 303.995 453.404 303.876C453.107 303.661 452.804 303.454 452.484 303.29C452.2 303.146 451.785 303.076 451.539 302.906C451.315 302.76 451.376 302.84 451.386 302.559ZM437.566 295.401C437.552 295.3 437.553 295.277 437.559 295.298C437.439 293.955 437.784 292.357 438.751 291.364C439.281 290.828 439.903 290.537 440.619 290.308C441.384 290.066 442.063 290.157 442.824 290.375C445.896 291.269 446.778 294.946 447.631 297.599C448.195 299.35 448.732 301.115 449.324 302.857C448.639 303.009 447.917 303.164 447.27 303.448C446.987 303.574 446.756 303.798 446.473 303.925C446.238 304.03 445.988 304.004 445.738 303.955C444.463 303.742 443.082 303.137 442.055 302.363C440.97 301.546 439.839 300.515 439.075 299.387C438.32 298.264 437.845 296.902 437.591 295.567C437.602 295.579 437.588 295.531 437.566 295.401ZM428.195 307.722C428.197 307.729 428.197 307.729 428.195 307.722C428.197 307.729 428.197 307.729 428.195 307.722ZM432.722 313.07C432.697 313.062 432.688 313.057 432.686 313.05C431.437 312.483 430.444 311.669 429.585 310.606C428.983 309.883 428.056 308.508 428.249 307.383C428.446 306.243 429.31 305.422 430.326 304.942C431.462 304.405 432.847 303.969 434.107 303.863C435.351 303.755 436.631 303.929 437.849 304.129C439.093 304.336 440.333 304.612 441.484 305.132C442.061 305.396 442.624 305.663 443.158 305.991C443.333 306.099 443.761 306.293 443.859 306.475C443.942 306.632 443.593 307.056 443.48 307.269C442.908 308.344 442.647 309.496 442.575 310.699C442.538 311.282 442.539 311.868 442.592 312.448C442.606 312.655 442.637 312.631 442.498 312.731C442.417 312.792 442.193 312.804 442.088 312.834C441.749 312.923 441.417 313.034 441.084 313.145C440.363 313.382 439.732 313.563 438.981 313.643C438.253 313.725 437.527 313.813 436.8 313.818C435.466 313.825 434.169 313.565 432.92 313.126C433.06 313.191 433.137 313.222 432.722 313.07ZM443.172 321.971C442.232 323.189 441.236 324.454 439.947 325.329C438.663 326.195 436.91 327.067 435.329 327.115C433.809 327.16 432.41 326.199 431.787 324.85C431.507 324.245 431.136 323.35 431.215 322.673C431.289 321.981 431.737 321.243 432.147 320.688C432.132 320.715 432.13 320.708 432.187 320.639C432.176 320.657 432.159 320.677 432.147 320.688C432.164 320.668 432.202 320.612 432.231 320.582C432.321 320.473 432.402 320.359 432.492 320.25C432.632 320.075 432.778 319.897 432.926 319.727C433.276 319.333 433.652 318.976 434.066 318.647C434.903 317.969 435.843 317.436 436.808 316.963C437.774 316.497 438.746 316.075 439.757 315.709C440.823 315.328 441.952 315.109 443.037 314.79C443.226 315.473 443.458 316.152 443.895 316.719C444.106 317.005 444.343 317.275 444.607 317.508C444.738 317.621 444.872 317.718 445.015 317.82C445.264 317.997 445.228 317.925 445.153 318.194C444.811 319.46 444.054 320.709 443.302 321.79C443.3 321.783 443.275 321.828 443.172 321.971ZM454.923 327.923C454.926 327.96 454.928 327.967 454.928 327.967C455.163 330.662 452.221 331.726 450.098 332.343C449.579 332.492 449.03 332.642 448.491 332.481C447.91 332.309 447.523 331.833 447.234 331.329C446.94 330.834 446.783 330.261 446.611 329.716C446.418 329.071 446.201 328.419 446.138 327.751C446.021 326.55 446.106 325.367 446.288 324.178C446.48 322.918 446.578 321.647 446.8 320.386C446.855 320.077 446.925 319.763 446.989 319.459C447.015 319.338 447.039 319.211 447.072 319.089C447.084 319.025 447.098 318.968 447.111 318.904C447.094 318.714 447.165 318.671 447.32 318.762C447.568 318.728 447.909 318.856 448.164 318.873C448.458 318.894 448.751 318.908 449.044 318.899C449.668 318.877 450.286 318.783 450.892 318.646C451.085 318.606 451.169 318.529 451.28 318.648C451.348 318.726 451.376 318.959 451.42 319.059C451.547 319.369 451.702 319.671 451.857 319.973C453.099 322.447 454.324 325.046 454.89 327.782C454.883 327.731 454.889 327.752 454.923 327.923ZM450.862 316.615C449.018 317.144 445.739 317.168 444.878 314.17C444.017 311.173 444.734 306.194 448.254 305.183C451.774 304.171 453.392 305.815 454.029 308.033C454.666 310.252 455.16 315.38 450.862 316.615ZM456.356 321.948C456.299 321.881 456.249 321.813 456.192 321.746C456.218 321.784 456.251 321.82 456.282 321.848C455.221 320.505 454.318 319.055 453.245 317.722C453.257 317.711 453.275 317.721 453.284 317.726C453.284 317.673 453.347 317.655 453.452 317.572C453.548 317.507 453.634 317.437 453.72 317.367C453.918 317.212 454.111 317.037 454.287 316.858C454.642 316.508 454.979 316.125 455.256 315.714C455.394 315.508 455.517 315.3 455.621 315.082C455.722 314.88 455.773 314.579 455.907 314.413C456.029 314.257 455.898 314.302 456.089 314.308C456.195 314.307 456.337 314.402 456.43 314.436C456.688 314.542 456.941 314.658 457.195 314.773C459.203 315.687 461.099 316.738 462.796 318.155C462.525 317.925 463.076 318.391 462.796 318.155C464.051 319.195 464.978 320.864 465.452 322.407C465.915 323.915 465.292 325.577 463.882 326.373C463.15 326.787 462.444 326.945 461.678 326.577C460.983 326.243 460.316 325.824 459.71 325.351C458.427 324.349 457.302 323.099 456.273 321.844C456.308 321.886 456.332 321.917 456.356 321.948ZM454.773 349.092C452.221 349.825 450.305 350.104 448.804 349.715C449.768 348.421 450.861 347.151 452.047 346.05C453.323 344.863 454.807 343.925 456.297 343.037C457.729 342.182 459.287 341.742 460.883 341.298C462.556 340.833 464.184 340.531 465.922 340.453C465.658 340.747 460.08 347.567 454.773 349.092ZM477.864 321.544C477.883 321.719 477.872 321.654 477.863 321.597C478.114 324.581 476.495 327.35 475.015 329.831C474.225 331.149 469.537 337.103 468.501 338.199C468.576 335.106 469.553 330.526 471.006 327.737C471.72 326.365 472.571 325.127 473.749 324.104C474.977 323.043 476.373 322.115 477.835 321.417C477.847 321.458 477.852 321.502 477.864 321.544Z" fill="#10A6ED" fill-opacity="0.2"/>
<path d="M426.714 359.244C408.615 364.443 398.159 383.327 403.358 401.427C408.557 419.527 427.442 429.983 445.542 424.784C463.642 419.584 474.098 400.7 468.898 382.6C463.699 364.5 444.809 354.046 426.714 359.244ZM444.749 422.024C444.744 422.026 444.738 422.028 444.732 422.029C447.31 416.57 454.034 399.995 448.998 384.61C448.742 383.867 448.552 383.629 448.141 383.728C447.581 383.92 447.017 384.1 446.49 384.282C446.08 384.424 446.008 384.725 446.168 385.179C451.23 400.697 444.153 417.465 441.577 422.759C429.646 424.881 417.754 419.836 410.862 410.361C412.03 408.123 414.17 404.028 414.648 403.165C427.034 380.794 440.232 382.105 439.505 379.576C439.405 379.227 437.719 378.706 436.221 379.136C431.625 380.456 421.384 385.105 411.741 402.512C410.573 404.622 409.681 406.61 409.179 407.79C407.888 405.588 406.852 403.191 406.118 400.635C403.642 392.018 405.065 383.197 409.319 376.043C411.199 375.137 414.255 373.827 418.287 372.668C429.201 369.533 435.548 374.141 438.381 373.328C438.674 373.244 438.802 372.926 438.727 372.667C438.402 371.535 437.641 371.199 436.989 370.838C436.336 370.477 426.814 367.231 417.962 369.775C416.019 370.333 414.024 370.985 412.652 371.452C416.469 367.082 421.526 363.721 427.507 362.003C430.852 361.042 434.228 360.676 437.527 360.826C438.359 362.342 440.076 365.69 441.076 369.17C441.21 369.637 441.439 369.84 441.856 369.72C442.391 369.567 442.95 369.369 443.519 369.206C443.969 369.077 443.934 368.763 443.717 368.009C442.789 364.776 441.489 362.418 440.661 361.126C447.493 362.139 453.819 365.4 458.6 370.348C457.605 370.597 456.527 370.919 455.373 371.36C454.638 371.645 454.409 371.845 454.524 372.245C454.736 372.793 454.935 373.358 455.132 373.874C455.285 374.281 455.589 374.34 456.039 374.168C457.604 373.567 459.229 373.112 460.701 372.762C463.115 375.836 464.994 379.406 466.137 383.387C466.75 385.521 467.124 387.67 467.273 389.803C465.868 387.244 462.923 383.256 457.211 380.093C456.522 379.711 456.222 379.664 455.987 380.012C455.702 380.526 455.398 381.04 455.129 381.526C454.916 381.91 455.067 382.178 455.493 382.409C463.162 386.656 466.144 393.109 467.115 395.872C465.6 407.896 457.116 418.472 444.749 422.024Z" fill="#10A6ED" fill-opacity="0.2"/>
<path d="M339.559 364.573C339.46 364.668 339.361 364.763 339.262 364.858C336.291 367.574 339.49 364.626 339.559 364.573Z" fill="#10A6ED" fill-opacity="0.2"/>
<path d="M331.841 291.396C333.876 292.539 329.817 290.291 331.841 291.396V291.396Z" fill="#10A6ED" fill-opacity="0.2"/>
<path d="M302.45 290.488C302.518 289.921 302.019 289.791 301.548 289.762C301.165 290.036 301.451 290.228 302.45 290.488Z" fill="#10A6ED" fill-opacity="0.2"/>
<path d="M374.296 355.561C376.998 357.869 383.34 362.311 388.326 365.018C388.509 365.106 388.607 365.168 388.924 365.313C389.209 365.429 389.526 365.527 389.874 365.575C390.557 365.674 391.378 365.582 392.092 365.156C392.449 364.944 392.76 364.674 393.018 364.321C393.275 363.967 393.447 363.518 393.5 363.118C393.596 362.295 393.395 361.738 393.274 361.338C393.129 360.918 392.991 360.595 392.852 360.249L392.431 359.23C392.146 358.552 391.852 357.882 391.549 357.21C391.25 356.544 390.937 355.88 390.62 355.22L390.268 354.509C390.252 354.451 390.145 354.349 390.24 354.31C390.318 354.318 390.362 354.401 390.428 354.443L390.926 354.82C391.307 355.102 391.69 355.376 392.077 355.646C392.856 356.182 393.654 356.694 394.465 357.172C395.285 357.651 396.09 358.093 396.962 358.53C397.415 358.745 397.908 358.961 398.492 359.093C399.068 359.225 399.766 359.265 400.442 359.045C401.13 358.831 401.719 358.358 402.091 357.824C402.476 357.287 402.693 356.69 402.792 356.094C402.899 355.507 402.862 354.841 402.722 354.282C402.587 353.719 402.368 353.2 402.114 352.734C401.595 351.788 401.013 351.067 400.404 350.321C399.793 349.593 399.172 348.92 398.546 348.243C398.377 348.064 398.211 347.891 398.042 347.712C399.085 348.349 400.157 348.962 401.26 349.526C402.095 349.937 402.944 350.336 403.853 350.663C404.744 350.997 405.738 351.254 406.793 351.342C407.214 351.362 407.672 351.408 408.231 351.395C408.511 351.388 408.819 351.358 409.155 351.265C409.491 351.181 409.853 351.004 410.156 350.764C410.456 350.519 410.695 350.221 410.85 349.936C411.019 349.647 411.148 349.311 411.217 348.978C411.358 348.308 411.278 347.676 411.137 347.126C410.834 346.027 410.343 345.185 409.736 344.326C409.709 344.293 409.658 344.231 409.658 344.231L409.651 344.221C409.651 344.221 410.901 344.792 412.148 345.096L412.904 345.254C413.162 345.289 413.428 345.333 413.687 345.359C414.197 345.401 414.71 345.418 415.222 345.395C416.247 345.35 417.268 345.173 418.25 344.854C418.742 344.689 419.228 344.498 419.68 344.256L420.362 343.888C420.584 343.762 420.801 343.601 421.02 343.462C421.874 342.859 422.677 342.115 423.274 341.207C424.499 339.39 424.879 337.17 424.782 335.141C424.675 333.09 424.211 331.156 423.567 329.282C422.464 326.167 420.888 323.755 419.359 321.971L417.863 320.373C417.196 319.722 416.561 319.187 415.983 318.732C414.824 317.857 413.914 317.365 413.777 317.478C413.567 317.648 416.346 320.02 419.218 325.104C419.876 326.278 421.367 328.965 422.161 332.245C422.552 333.867 422.79 335.613 422.551 337.171C422.433 337.949 422.224 338.682 421.913 339.309C421.585 339.926 421.206 340.481 420.763 340.899C419.556 342.059 417.896 342.869 416.158 343.118C415.295 343.245 414.373 343.261 413.514 343.131C412.663 343.011 411.781 342.726 410.909 342.377C409.162 341.665 407.458 340.705 405.798 339.653C405.385 339.389 404.975 339.122 404.567 338.845L403.955 338.426L403.669 338.241C403.51 338.133 403.265 338.008 402.989 337.981C402.717 337.949 402.428 338.011 402.206 338.129C401.76 338.367 401.488 338.772 401.44 339.294C401.418 339.549 401.481 339.839 401.607 340.061C401.727 340.295 401.931 340.477 401.931 340.477C402.13 340.663 402.325 340.852 402.526 341.021C402.93 341.38 403.343 341.7 403.751 342.016C405.391 343.266 411.082 347.068 408.745 348.979C407.842 349.716 404.37 348.435 403.522 348.058C401.824 347.298 400.179 346.314 398.595 345.296C396.285 343.808 394.037 342.192 391.835 340.506L391.009 339.873L390.596 339.553L390.394 339.393L390.346 339.353C390.383 339.379 390.197 339.229 390.026 339.156C389.66 338.979 389.126 338.996 388.784 339.197C388.433 339.388 388.198 339.683 388.084 340.077C387.963 340.461 388.067 340.986 388.302 341.293C388.352 341.364 388.419 341.436 388.474 341.494L388.498 341.514L388.545 341.562L388.636 341.654L389.009 342.023L389.759 342.756L392.733 345.706C394.692 347.677 396.685 349.669 398.455 351.708C399.303 352.726 400.15 353.801 400.39 354.754C400.455 355.009 400.48 355.195 400.475 355.421C400.466 355.642 400.422 355.86 400.346 356.057C400.188 356.456 399.954 356.694 399.708 356.761C399.459 356.853 399.032 356.806 398.515 356.61C398.011 356.42 397.408 356.089 396.82 355.778C395.654 355.146 394.513 354.447 393.408 353.687L392.585 353.107L392.183 352.809L391.601 352.359C391.167 352.032 390.59 351.529 390.086 351.125L389.317 350.534C389.113 350.439 388.941 350.413 388.751 350.355L388.615 350.315L388.524 350.31L388.346 350.305C388.215 350.301 388.129 350.292 387.972 350.333C387.643 350.396 387.175 350.676 386.948 351.028C386.826 351.199 386.763 351.345 386.735 351.447L386.657 351.797C386.658 352.128 386.608 352.455 386.871 353.048L387.733 354.704L388.378 356.007C388.644 356.574 388.91 357.133 389.176 357.7C389.694 358.829 390.181 359.968 390.642 361.104C390.88 361.686 391.104 362.232 391.137 362.554C391.152 362.716 391.139 362.798 391.117 362.839C391.1 362.885 391.048 362.967 390.945 363.036C390.765 363.175 390.466 363.245 390.141 363.186C390.059 363.173 389.983 363.148 389.907 363.123C389.815 363.088 389.798 363.086 389.641 363.001L388.853 362.599C384.674 360.444 381.051 357.931 377.773 355.588C375.524 353.98 374.078 352.88 373.259 352.313C372.775 351.964 372.514 351.781 372.419 351.859C372.319 351.949 373.013 354.194 374.296 355.561Z" fill="#10A6ED" fill-opacity="0.2"/>
</g>
<g clip-path="url(#clip1)">
<path d="M42.2966 220.005C39.0446 208.685 24.4679 199.26 7.13713 204.238C-10.1936 209.217 -10.0058 224.59 -9.48596 224.876C-9.15997 225.055 -7.76285 211.403 7.90265 206.903C19.2646 203.639 35.7034 207.151 39.6171 220.775C42.9356 232.327 34.8158 249.563 26.942 251.825C19.0612 254.088 6.67346 249.959 3.3236 238.298C-0.0262619 226.637 10.438 217.743 16.6261 215.966C23.8832 213.881 30.4481 218.761 32.0066 224.186C34.1445 231.628 29.648 239.139 23.0214 241.043C16.3947 242.947 11.4422 238.954 10.1677 234.517C8.95967 230.312 12.5535 224.617 18.0152 223.048C21.5169 222.042 24.6076 221.877 25.3751 224.549C26.3403 227.909 22.768 231.561 20.4928 232.215C18.2177 232.869 15.9162 231.7 15.413 229.948C14.9098 228.197 16.253 226.623 16.253 226.623C15.5745 226.25 13.7213 229.328 14.434 231.809C14.8745 233.342 16.7923 236.17 21.2603 234.887C26.2491 233.454 29.0021 227.078 28.0564 223.786C27.1108 220.494 23.193 218.683 17.2516 220.39C11.3102 222.096 5.51861 228.43 7.49015 235.294C9.46366 242.164 16.6208 245.774 23.7957 243.713C31.1076 241.612 37.5748 233.446 34.6949 223.421C32.7625 216.694 24.6478 210.784 15.8694 213.306C6.17954 216.089 -2.75173 227.221 0.652952 239.073C3.59363 249.309 15.162 258.101 27.7163 254.494C37.4815 251.689 45.7286 231.952 42.2966 220.005Z" fill="#10A6ED" fill-opacity="0.2"/>
<path d="M51.6439 267.228C55.2986 267.105 59.1818 263.957 60.016 263.234C59.601 264.535 55.8313 271.337 59.4702 274.776C61.7246 276.906 66.0719 277.773 70.1531 273.454C74.1579 269.216 71.9462 263.416 71.2356 262.075C72.7019 262.897 75.7575 264.79 79.3132 264.612C81.4475 264.506 83.8552 263.53 85.8696 261.399C87.5164 259.656 87.9563 256.257 85.577 254.008C82.8478 251.429 77.6318 251.061 77.3232 251.037C77.3232 251.037 79.7476 249.723 81.4278 247.945C84.6498 244.536 83.6022 239.176 80.708 236.441C77.6189 233.522 72.9862 234.489 69.4778 238.202C67.4587 240.339 66.8086 243.109 66.608 243.952C66.4166 243.494 64.6015 240.268 62.642 238.417C59.7429 235.677 55.0058 236.144 52.7003 238.584C49.9986 241.443 50.108 245.983 53.3771 249.072C54.4818 250.116 55.8135 251.04 56.1666 251.297C55.8096 251.294 50.3601 251.193 46.8995 254.856C43.3481 258.614 43.6168 262.635 46.4809 265.342C48.16 266.909 49.9827 267.283 51.6439 267.228ZM62.3876 258.782C59.8733 256.406 60.672 253.508 62.5432 251.528C65.5265 248.371 69.5083 249.715 71.0429 251.165C73.3422 253.338 71.3344 256.814 70.3129 257.895C67.6539 260.699 63.8771 260.19 62.3876 258.782ZM68.6814 261.364C69.2795 262.493 72.0127 268.212 68.5663 271.859C65.5926 275.006 62.4845 274.66 60.9549 273.215C59.6953 272.025 59.8264 270.074 60.3033 268.277C61.007 265.5 62.7533 262.56 62.8806 261.505C65.0833 262.668 68.6814 261.364 68.6814 261.364ZM71.3374 259.705C74.5058 256.512 74.1903 253.221 74.1765 253.046C74.1765 253.046 81.0775 252.902 83.9816 255.646C85.2112 256.808 85.2911 258.787 84.1025 260.044C78.9428 265.515 72.8262 260.442 71.3374 259.705ZM79.8007 246.723C77.8102 248.83 75.314 249.569 73.5416 250.954C71.9153 248.069 68.2448 247.507 68.1221 247.487C68.2355 246.255 69.0063 241.935 71.1305 239.687C73.2546 237.439 76.7917 235.819 79.2709 238.162C81.0854 239.877 82.4976 243.869 79.8007 246.723ZM66.1187 247.334C62.9944 247.556 60.8299 249.747 59.8637 251.32C59.8637 251.32 56.6581 249.075 54.6887 247.214C52.7143 245.348 52.5168 242.082 54.3211 240.173C56.135 238.253 59.3706 238.194 61.265 239.984C64.0742 242.638 64.7382 245.14 65.5383 246.336C65.7684 246.773 66.1037 247.32 66.1187 247.334ZM59.0234 253.05C58.8822 253.5 57.5857 257.285 60.4848 260.025C59.7622 260.709 54.8805 264.874 51.9146 264.968C50.4586 265.017 49.3351 264.855 48.0754 263.664C47.6256 263.239 44.5576 260.388 48.3906 256.332C50.0087 254.619 52.0135 253.769 53.9682 253.503C55.6012 253.287 57.0272 253.42 59.0234 253.05Z" fill="#10A6ED" fill-opacity="0.2"/>
<path d="M105.175 220.398C104.816 219.935 104.617 219.338 104.757 218.967C104.75 218.872 104.768 218.736 104.796 218.687C104.859 218.365 105.599 217.925 106.402 217.825C107.198 217.7 108.079 217.799 108.663 218.114C109.188 218.37 109.577 219.037 109.56 219.641C109.56 220.255 109.188 220.824 108.584 221.128L108.523 221.16C107.964 221.423 107.256 221.434 106.656 221.186L105.175 220.398ZM59.7002 195.082C59.8408 195.007 59.8148 195.014 59.8213 195.013L59.8343 195.009C59.8538 195.003 59.8658 195.021 59.863 195.035C59.8583 195.043 59.8601 195.05 59.8536 195.052L59.8425 195.062C59.8125 195.105 59.7246 195.24 59.6583 195.328C59.3629 195.723 58.9905 196.12 58.606 196.499C57.9949 197.095 57.3217 197.647 56.6217 198.179C57.3499 197.157 58.179 196.215 59.0917 195.491C59.2958 195.343 59.5018 195.201 59.7002 195.082ZM78.9731 206.967C79.015 205.273 79.8589 203.72 81.3053 202.891C81.8018 202.583 82.2674 202.339 82.6994 202.125C83.0555 202.064 83.4417 201.912 83.9091 201.895C84.0317 201.88 84.1609 201.864 84.2919 201.854C84.5336 201.812 84.79 201.821 85.0427 201.817C85.2165 201.809 85.405 201.803 85.5871 201.799C86.8833 201.944 88.1181 202.513 88.9531 203.383C89.1872 203.584 89.6368 204.021 89.7889 204.28C90.3236 204.988 90.5945 205.883 90.6326 206.727C90.6776 207.472 90.2981 208.408 89.8401 209.243C88.8897 210.916 87.4354 212.478 85.8155 213.267C85.6134 213.373 85.4145 213.417 85.2134 213.502C85.0155 213.525 84.8275 213.606 84.6287 213.601C84.2505 213.634 83.7648 213.587 83.401 213.499C82.6078 213.265 81.8261 212.752 81.1685 212.106C80.03 210.965 79.2195 209.419 79.0175 207.857L78.9731 206.967ZM82.7301 180.297C83.1239 179.901 83.5175 179.554 83.9139 179.191L84.3559 178.816L84.643 178.589C84.8388 178.436 85.0299 178.292 85.2275 178.145C85.6245 177.859 86.0372 177.603 86.4535 177.359C87.2898 176.884 88.1731 176.499 89.0818 176.252C89.9887 175.999 90.9293 175.887 91.874 175.912C92.749 175.916 93.6685 176.148 94.5988 176.467C97.1031 177.333 99.5001 178.954 100.659 181.22C101.242 182.342 101.514 183.608 101.434 184.9C101.453 185.211 101.382 185.555 101.345 185.89L101.212 186.901C101.054 187.553 100.927 188.216 100.713 188.843C99.884 191.356 98.36 193.559 96.3839 195.071C94.4455 196.641 92.1497 197.556 89.9811 198.055C88.0386 198.482 86.7155 198.538 85.9934 198.601C85.8708 198.615 85.7695 198.63 85.6746 198.644L85.5455 198.44C85.3647 198.154 85.1839 197.868 84.9854 197.594C84.6061 197.034 84.1998 196.503 83.8101 195.981C83.013 194.948 82.2332 194 81.5744 193.204C79.7793 191.003 77.8669 188.836 75.9762 186.622C74.0743 184.417 72.2311 182.148 70.3788 179.846C68.5284 177.551 66.6808 175.242 64.7697 173.005C64.3825 172.565 63.9952 172.125 63.608 171.685C63.6072 171.657 63.5998 171.632 63.5779 171.555C63.5065 171.307 63.4315 171.046 63.3437 170.74C63.0917 169.765 62.323 167.58 61.9901 165.145C61.9083 164.541 61.8804 163.929 61.9257 163.35C61.9729 162.778 62.1307 162.175 62.306 161.607C62.6827 160.465 63.2447 159.428 63.8307 158.646C65.3862 156.455 67.8649 154.95 70.5947 154.835C73.3283 154.684 76.0546 155.783 78.0955 157.637C80.1719 159.467 81.5037 162.042 82.0817 164.716C82.3431 166.068 82.4903 167.439 82.3996 168.817C82.3777 170.188 82.1246 171.515 81.763 172.833C81.5005 173.784 81.172 174.726 80.8009 175.667L80.5069 176.385L79.8893 177.817C79.4819 178.755 78.9895 179.813 78.9338 180.429C78.8906 180.745 78.9231 180.956 78.9743 181.134C79.0396 181.288 79.1152 181.404 79.2 181.552C79.2415 181.623 79.2848 181.7 79.3904 181.773C79.4107 181.795 79.4441 181.813 79.4728 181.839L79.483 181.85C79.4989 181.832 79.4549 181.899 79.5212 181.811L79.5296 181.816L79.5546 181.829L79.6046 181.856L79.7483 181.939C79.8817 182.011 79.9641 182.077 80.1024 182.093C80.3642 182.121 80.7795 182.119 81.5508 181.442C81.9191 181.129 82.3421 180.663 82.7301 180.297ZM73.9716 218.607C73.2993 219.799 72.4088 220.945 71.3334 221.715C70.2561 222.48 69.0328 222.859 67.9697 222.937C67.2448 223.014 66.4926 222.947 65.724 222.824C65.3397 222.762 64.9562 222.727 64.5813 222.649L63.4735 222.326L62.9206 222.167L62.3949 221.932L61.3436 221.462L60.37 220.846C60.2126 220.739 60.0392 220.651 59.8846 220.53L59.4404 220.161C58.2175 219.216 57.2271 217.977 56.3952 216.651C55.5501 215.329 54.9157 213.857 54.4376 212.34C53.9613 210.829 53.6386 209.239 53.5536 207.692C53.5191 207.302 53.5329 206.933 53.5466 206.563C53.5733 206.19 53.6122 205.786 53.6734 205.41C53.7902 204.639 53.958 203.874 54.1889 203.132C54.2832 202.822 54.3941 202.521 54.5051 202.22C55.984 201.382 57.3855 200.421 58.7084 199.358C59.3816 198.807 60.0308 198.22 60.645 197.561C60.954 197.238 61.2472 196.885 61.5248 196.502L61.7437 196.184C61.8428 196.038 61.9225 195.85 62.0078 195.681C62.0996 195.509 62.1766 195.336 62.2108 195.16C62.2599 194.988 62.322 194.811 62.3088 194.643C62.3806 193.96 61.9765 193.339 61.446 192.94C60.8772 192.579 60.148 192.568 59.4277 192.858C58.5855 193.189 58.3318 193.434 57.9264 193.716C57.5489 193.997 57.2067 194.302 56.8811 194.616C55.5953 195.882 54.5754 197.312 53.739 198.842C53.4373 199.411 53.1607 199.994 52.9137 200.582C51.002 201.607 47.7388 203.006 44.9908 202.837C42.2427 202.668 36.0844 201.08 36.6787 193.236C37.5578 181.746 44.8482 176.97 51.7438 177.395C52.0085 177.409 52.2396 177.453 52.4717 177.476C52.5785 177.48 52.7177 177.522 52.7409 177.53C52.7474 177.528 52.7604 177.524 52.7753 177.527C52.8987 177.76 53.0222 177.993 53.1456 178.227C54.15 180.055 55.2299 181.826 56.3545 183.558C59.4694 188.316 62.992 193.095 66.6307 197.469C68.45 199.655 70.3023 201.736 72.2001 203.632C73.1555 204.577 74.1111 205.475 75.1266 206.286C75.3755 206.49 75.6375 206.691 75.8977 206.885L76.2968 207.17L77.1056 207.655C76.9517 209.671 75.4929 215.977 73.9716 218.607ZM72.631 185.797C73.4035 186.719 74.1825 187.64 74.9792 188.549L75.3886 189.017C77.1677 191.064 78.971 193.096 80.6858 195.189C81.5357 196.234 82.3633 197.299 83.1193 198.385C83.2964 198.658 83.5015 198.93 83.6656 199.207L84.0658 199.864C84.0676 199.871 84.0629 199.879 84.0527 199.868L84.0546 199.875C84.0611 199.873 84.0481 199.876 84.0629 199.879L84.076 199.875L83.9598 199.888L83.7293 199.92C83.1233 199.97 82.5418 200.178 81.9865 200.331C81.6376 200.465 81.3155 200.62 81.0054 200.792C80.5856 200.974 80.0865 201.249 79.6073 201.642C78.7505 202.315 78.0493 203.309 77.6863 204.082C77.4736 204.495 77.3193 204.939 77.2012 205.387C76.8151 205.098 76.4347 204.78 76.0656 204.451C74.5703 203.123 73.1854 201.639 71.8564 200.104C71.1648 199.365 69.8181 197.842 69.1583 197.067C65.2946 192.523 61.7523 187.798 58.5673 182.943C56.9869 180.508 55.4939 178.035 54.2187 175.485C53.5853 174.212 53.0021 172.918 52.5648 171.617C52.3503 170.968 52.1684 170.31 52.0644 169.678C51.9622 169.053 51.94 168.411 52.0784 167.985C52.1361 167.769 52.2399 167.615 52.3359 167.532C52.3771 167.479 52.5372 167.399 52.622 167.326C52.7283 167.254 52.852 167.219 52.9601 167.153C53.4124 166.961 53.9326 166.956 54.4978 167.084C55.6383 167.349 56.8025 168.138 57.8716 168.989C60.018 170.744 61.9303 172.911 63.8017 175.083C66.769 178.567 69.6297 182.219 72.631 185.797ZM42.2239 191.733C40.2931 191.612 38.6193 192.803 38.4643 194.84C38.3076 196.87 39.6382 199.907 41.9637 200.053C44.3384 200.198 46.0787 197.202 46.2079 195.518C46.3372 193.833 44.1481 191.856 42.2239 191.733ZM44.3524 195.389C44.2458 196.784 42.9746 198.149 42.0338 198.089C41.093 198.028 40.404 196.096 40.4969 194.849C40.5916 193.608 41.8757 193.563 42.1125 193.578C42.8229 193.622 44.4312 194.387 44.3524 195.389ZM67.1682 214.184C65.4529 214.077 63.8808 214.763 63.6646 217.617C63.5292 219.428 63.9616 221.62 66.9185 221.805C69.0351 221.934 70.5897 219.764 70.7078 218.262C70.8214 216.768 69.5856 214.331 67.1682 214.184ZM68.6672 218.421C68.5743 219.668 67.5518 220.01 66.7114 219.955C65.4056 219.875 65.3133 218.474 65.3973 217.368C65.4812 216.261 66.6435 216.21 66.8525 216.226C67.484 216.265 68.7933 216.799 68.6672 218.421ZM59.4678 205.731C59.3218 207.627 60.7079 210.097 62.7752 210.227C64.8425 210.357 66.445 208.87 66.6188 206.579C66.7945 204.247 64.1481 202.346 62.4393 202.237C60.3459 202.114 59.6284 203.665 59.4678 205.731ZM62.3924 204.208C63.8133 204.297 64.6532 205.724 64.5804 206.648C64.5075 207.572 64.1402 208.477 62.8707 208.4C61.2984 208.301 61.3096 205.567 61.3256 205.328C61.3807 204.637 61.6392 204.163 62.3924 204.208ZM47.026 187.079C46.869 189.158 48.1286 191.236 50.3473 191.378C52.4145 191.508 54.9643 189.686 55.1381 187.396C55.3139 185.063 53.3798 183.385 51.671 183.276C48.9295 183.106 47.2026 184.774 47.026 187.079ZM51.4588 185.04C52.4701 185.101 53.3747 185.993 53.3036 186.923C53.1873 188.432 51.8589 189.475 50.4593 189.388C49.318 189.316 48.8782 187.932 48.9513 186.96C49.0244 185.988 49.9868 184.946 51.4588 185.04ZM68.9192 160.976C68.7622 163.055 69.952 164.988 72.1706 165.13C74.2379 165.26 76.3563 163.114 76.5318 160.83C76.7076 158.497 75.0674 156.762 73.3586 156.654C70.6236 156.481 69.0958 158.671 68.9192 160.976ZM73.1834 158.841C74.1948 158.902 74.5337 159.984 74.4608 160.908C74.3444 162.416 73.5129 163.276 72.1133 163.188C70.972 163.116 71.0341 162.106 71.1072 161.133C71.1886 160.166 71.718 158.745 73.1834 158.841ZM71.051 172.47C70.894 174.548 72.0836 176.482 74.3023 176.623C76.3696 176.753 77.6439 174.933 77.8176 172.642C77.9934 170.31 76.0293 169.337 75.095 169.274C72.5838 169.12 71.2276 170.165 71.051 172.47ZM74.469 170.922C75.4804 170.983 75.9005 171.759 75.8276 172.683C75.7112 174.192 74.7004 174.648 74.1478 174.613C73.5953 174.579 72.8097 173.66 72.8847 172.694C72.9578 171.722 73.2338 170.843 74.469 170.922ZM95.8842 182.585C93.9534 182.464 92.2797 183.655 92.1247 185.692C91.9679 187.722 93.2985 190.759 95.624 190.905C97.9987 191.05 99.739 188.054 99.8682 186.37C100.004 184.683 97.8131 182.699 95.8842 182.585ZM98.0192 186.239C97.9127 187.635 96.6414 188.999 95.7006 188.939C94.7599 188.878 94.0708 186.946 94.1637 185.699C94.2584 184.458 95.5425 184.413 95.7793 184.428C96.4897 184.472 98.0962 185.231 98.0192 186.239ZM82.3849 186.235C82.2279 188.314 83.7931 190.008 86.0118 190.15C88.079 190.28 90.338 188.452 90.5136 186.168C90.6894 183.836 88.8515 182.468 85.888 182.285C83.6266 182.142 82.5003 184.747 82.3849 186.235ZM86.6121 184.069C87.6235 184.131 88.5776 185.146 88.5173 185.942C88.4187 187.218 87.2325 188.241 85.833 188.154C85.0222 188.104 84.1539 187.437 84.2288 186.471C84.3149 185.495 84.7686 183.958 86.6121 184.069ZM97.3545 230.2C97.5237 230.813 97.4128 231.507 97.0715 232.012L97.0322 232.071C96.6396 232.619 96.0159 232.901 95.3995 232.816C94.7885 232.75 94.1673 232.281 93.9821 231.734C93.7424 231.121 93.7658 230.245 94.0014 229.495C94.2101 228.725 94.7621 228.07 95.0882 228.052C95.145 228.029 95.288 228.036 95.3772 228.052C95.7686 227.967 96.3415 228.244 96.7576 228.662L97.3545 230.2ZM86.5736 215.317L94.3941 226.004C94.3681 226.012 94.3337 226.015 94.3077 226.022C93.5261 226.295 92.9895 226.856 92.6323 227.379C92.2657 227.919 92.031 228.475 91.8502 229.024C91.6032 229.832 91.5084 230.68 91.6261 231.556C91.6966 231.998 91.8247 232.444 92.0494 232.882C92.2806 233.319 92.654 233.736 93.0133 234.005C94.0334 234.808 95.5944 235.139 96.9048 234.597C98.2262 234.093 99.0751 232.877 99.2754 231.71C99.3664 231.291 99.4508 230.701 99.404 230.17C99.3979 230.075 99.3901 229.312 99.2649 228.852C98.9342 227.602 97.7946 226.31 96.9866 225.239C96.0778 224.038 89.4831 215.95 88.252 214.339C88.2921 214.307 88.3405 214.279 88.3806 214.247C89.0648 213.733 89.6647 213.147 90.1961 212.519C90.7265 211.912 91.0413 211.29 91.0413 211.29C92.5 212.712 100.624 219.106 101.714 220.151C102.68 221.087 103.818 222.373 105.039 222.87C105.486 223.052 106.259 223.168 106.348 223.184C106.877 223.307 107.483 223.306 107.917 223.271C109.119 223.236 110.461 222.581 111.154 221.362C111.874 220.163 111.763 218.602 111.092 217.492C110.876 217.106 110.507 216.681 110.095 216.399C109.684 216.124 109.249 215.932 108.816 215.801C107.944 215.562 107.083 215.534 106.233 215.668C105.649 215.767 105.059 215.922 104.47 216.202C103.894 216.478 103.253 216.924 102.874 217.639C102.86 217.664 102.854 217.693 102.84 217.718L92.1279 209.503C92.4861 208.738 92.714 208.059 92.8206 207.056C92.8525 205.744 92.5234 204.55 91.8975 203.475C91.2817 202.411 90.3694 201.59 89.417 201.023L87.6693 200.263C92.0584 199.912 96.5903 198.342 99.9857 194.581C100.804 193.774 101.898 191.791 102.337 190.769C102.602 189.997 102.942 189.244 103.094 188.449C103.186 188.057 103.285 187.663 103.37 187.273L103.522 186.085C103.732 184.508 103.653 182.738 103.041 181.17C102.439 179.592 101.398 178.223 100.159 177.151C98.9212 176.08 97.5071 175.28 96.0235 174.679C95.2854 174.367 94.5089 174.142 93.7202 173.948C93.3155 173.864 92.9062 173.789 92.4503 173.747C92.0277 173.724 91.6218 173.709 91.212 173.731C89.5638 173.784 87.9215 174.2 86.4478 174.886C85.7078 175.229 85.012 175.629 84.3505 176.074C84.0188 176.293 83.6992 176.53 83.3878 176.771C83.1053 176.99 82.655 177.361 82.7464 177.286C82.6839 177.339 82.6297 177.396 82.5691 177.454L82.4814 177.542C82.4636 177.554 82.4478 177.572 82.4283 177.578C82.4004 177.579 82.4061 177.549 82.4071 177.529C82.426 177.447 84.2023 173.497 84.5001 169.626C85.1483 161.161 79.824 153.349 71.7425 152.844C63.661 152.338 60.1589 160.218 59.9257 163.332C59.7473 165.631 60.5145 168.154 60.6352 168.575C59.9581 167.935 59.2567 167.309 58.4994 166.734C57.6151 166.085 56.6528 165.458 55.458 165.077C54.8662 164.882 54.1903 164.787 53.4953 164.821C52.7891 164.865 52.0839 165.109 51.4803 165.462L51.0424 165.753C50.8961 165.857 50.7226 166.038 50.576 166.19C50.3117 166.521 50.1057 166.884 49.9898 167.241C49.7497 167.951 49.7329 168.604 49.7655 169.208C49.8502 170.411 50.1586 171.46 50.5023 172.485C50.8646 173.525 51.2866 174.528 51.7504 175.505C43.1525 174.969 35.4234 181.015 34.5089 192.97C33.7505 202.819 41.6823 204.815 44.8398 205.011C47.9974 205.207 51.1835 203.809 51.9439 203.487C51.9297 203.56 51.9005 203.63 51.8863 203.704C51.693 204.552 51.5526 205.413 51.4846 206.28C50.8748 214.266 56.3315 224.232 66.7682 224.888C67.2067 224.893 67.6441 224.919 68.0903 224.853L68.7548 224.786L69.4187 224.644C71.1984 224.264 72.8056 223.209 74.0171 221.93C75.2064 220.624 76.0567 219.118 76.699 217.575C77.6056 215.308 77.9649 213.247 78.1428 211.486C78.636 212.344 79.2455 213.141 79.9717 213.829C80.8478 214.646 81.9009 215.343 83.2047 215.637C83.4413 215.7 83.6753 215.73 83.8955 215.735C84.1211 215.76 84.3543 215.762 84.6051 215.752C84.8531 215.757 85.0956 215.742 85.3337 215.687C85.5736 215.639 85.8237 215.602 86.0377 215.513C86.2265 215.459 86.3968 215.389 86.5736 215.317Z" fill="#10A6ED" fill-opacity="0.2"/>
<path d="M92.4034 68.6206C92.2232 68.135 91.9312 67.7093 91.5787 67.3569C90.8764 66.6372 89.8294 66.254 88.8279 66.3602C88.5885 66.401 88.3328 66.4326 88.1144 66.5233L87.7769 66.6481L87.5497 66.7553C87.2616 66.8869 86.9691 67.0268 86.6811 67.1584C85.5325 67.6977 84.4071 68.2234 83.3006 68.7437C82.7621 68.9961 82.2361 69.2449 81.7102 69.4937C81.4579 69.6081 81.1534 69.6118 80.892 69.5054C80.7613 69.4522 80.6395 69.3825 80.5434 69.2845C80.5434 69.2845 76.9221 65.2572 76.1166 64.3439C75.3111 63.4305 74.0918 62.7547 72.6096 63.2434C69.9218 64.1202 70.4958 67.3476 70.5232 67.7027C70.5667 68.6813 70.8326 70.8595 71.1463 73.2752C71.1664 73.416 71.1821 73.5651 71.2022 73.7059C71.2155 73.7998 71.2145 73.8908 71.2073 73.9836C71.1927 74.1693 71.135 74.3464 71.0466 74.5114C70.9563 74.67 70.8373 74.8228 70.6909 74.9277C70.6205 74.9898 70.5445 75.0326 70.4604 75.0707C70.3299 75.1361 70.1974 75.1951 70.0669 75.2605C68.9899 75.7653 67.9737 76.2457 67.1076 76.6341C66.5108 76.8963 65.9096 77.1667 65.3065 77.4307L64.3922 77.8399C63.9835 78.0481 63.5771 78.3114 63.276 78.705C62.6502 79.4571 62.4178 80.5151 62.6237 81.468C62.8026 82.4218 63.4564 83.3507 64.3611 83.7819C64.5804 83.9074 64.81 83.974 65.0459 84.0389C65.1792 84.0774 65.2367 84.0888 65.3231 84.1058L65.5697 84.1606L66.5704 84.3827C67.2363 84.5265 67.904 84.6767 68.5699 84.8204L70.5757 85.2563L71.5827 85.4766C71.6835 85.4965 71.6997 85.5058 71.751 85.519C71.7898 85.5358 71.8392 85.5425 71.8799 85.5657C71.9637 85.5975 72.0386 85.6458 72.1154 85.7005C72.261 85.8053 72.3844 85.9513 72.4639 86.1099C72.5068 86.1884 72.539 86.2768 72.5631 86.3606C72.589 86.4509 72.5913 86.5061 72.6173 86.715L72.8636 88.8011C73.0256 90.1924 73.184 91.5709 73.3486 92.9475C73.3807 93.2245 73.4415 93.8143 73.6512 94.2845C73.8566 94.763 74.1641 95.2191 74.5693 95.5424C75.3557 96.2239 76.4019 96.5097 77.3955 96.329C78.3939 96.1888 79.316 95.4283 79.7436 94.6005C80.0717 94.0176 80.3936 93.4365 80.7174 92.8619C81.1888 92.0215 81.6521 91.1765 82.1173 90.3378L82.8141 89.0767L82.9839 88.7697C83.0123 88.7266 83.0388 88.6771 83.0753 88.6387C83.1401 88.5573 83.2212 88.4851 83.3079 88.4323C83.4857 88.3184 83.6945 88.2654 83.903 88.2823C83.9318 88.288 83.9569 88.2808 83.9812 88.2947C84.01 88.3004 84.0163 88.2986 84.0883 88.3128L84.4356 88.3875L85.1366 88.5352L87.9404 89.1258L89.3405 89.4146L90.0414 89.5622L90.3976 89.6205L90.5785 89.6592L90.8464 89.6939C91.5614 89.7957 92.3531 89.645 92.9937 89.2516C93.6361 88.8646 94.1259 88.2772 94.4119 87.5948C94.6998 86.9188 94.7782 86.1284 94.601 85.3697C94.5598 85.1791 94.4892 85.0039 94.4229 84.8206C94.3522 84.6454 94.252 84.4857 94.1625 84.316C94.0686 84.1545 93.9471 84.0149 93.838 83.8718L93.7527 83.7637L93.691 83.6906L93.5713 83.5575L91.6045 81.4142C91.1512 80.9232 90.6978 80.4322 90.2426 79.9348L89.5598 79.1886L89.2144 78.8132C89.1446 78.7356 89.1508 78.7338 89.1128 78.6958C89.0891 78.6607 89.061 78.6339 89.0437 78.597C88.8706 78.3256 88.8289 77.9677 88.9323 77.6658C88.9481 77.6263 88.9577 77.5887 88.9753 77.5557L89 77.4997L89.0575 77.3925L89.2961 76.947L89.7797 76.0543C90.4286 74.8627 91.0731 73.6794 91.7176 72.4961L92.1967 71.6116C92.414 71.1863 92.6028 70.6853 92.6269 70.1549C92.6606 69.8939 92.6259 69.6317 92.6039 69.3658C92.5523 69.1153 92.5114 68.8549 92.4034 68.6206ZM90.1477 70.4343C89.4829 71.6653 88.8182 72.8963 88.1578 74.119L87.1642 75.954L87.0405 76.185C87.0007 76.2593 86.9591 76.3271 86.8965 76.4637C86.7809 76.6993 86.6896 76.9489 86.6353 77.2088C86.5185 77.724 86.5187 78.2684 86.64 78.785C86.755 79.3034 86.9972 79.7922 87.3268 80.207L87.4521 80.3595L87.5437 80.4658L87.7215 80.659L88.0706 81.0473L89.4717 82.5923L90.8709 84.1308L91.5674 84.901L91.9147 85.2828C92.0607 85.4363 92.0636 85.4704 92.1335 85.548C92.3183 85.8369 92.3714 86.1637 92.2666 86.5079C92.16 86.8457 91.9001 87.1227 91.6047 87.2286C91.456 87.2782 91.3018 87.3086 91.1165 87.2781C91.0652 87.2649 91.0482 87.2767 90.9618 87.2597L90.7153 87.2049L90.2177 87.1035L88.2318 86.6898L86.246 86.276L85.2571 86.0715L84.7596 85.9701L84.513 85.9153C84.4203 85.9001 84.2764 85.8716 84.1568 85.8571C83.1463 85.7426 82.1167 86.129 81.4208 86.8734C81.249 87.0554 81.0909 87.2613 80.9653 87.4859C80.8928 87.6114 80.8663 87.6609 80.8221 87.7434L80.7028 87.9661L80.2192 88.8589L78.2824 92.4446L77.7988 93.3374C77.7079 93.517 77.6633 93.5508 77.6147 93.6415C77.5605 93.7129 77.5026 93.7715 77.4429 93.8235C77.3253 93.9341 77.1722 93.992 77.0173 94.0435C76.8524 94.0839 76.6789 94.0709 76.5017 94.045C76.3271 94.0044 76.1746 93.9226 76.031 93.8243C75.898 93.7159 75.8071 93.5884 75.7231 93.438C75.7053 93.3524 75.6455 93.2859 75.6446 93.1884C75.6379 93.1414 75.625 93.0963 75.612 93.0512L75.5811 92.8018L75.4564 91.7767C75.2873 90.4083 75.1245 89.0381 74.9555 87.6697L74.8307 86.6446C74.8039 86.4568 74.7994 86.3464 74.7493 86.0537C74.6977 85.8033 74.6254 85.5518 74.5218 85.3094C74.1174 84.3506 73.2649 83.6043 72.2782 83.3364C70.932 83.046 69.5858 82.7557 68.2333 82.4671L66.2375 82.0423C65.9271 81.9779 65.4996 81.8843 65.3996 81.8433C65.3283 81.8079 64.9359 81.7182 64.7541 81.1562C64.529 80.467 64.9755 80.0596 64.9755 80.0596L65.1546 79.9034L65.3781 79.7833C65.3781 79.7833 67.6701 78.734 68.8224 78.2076C69.3986 77.9444 69.9747 77.6811 70.5508 77.4179L71.449 76.9994C71.889 76.7822 72.2787 76.4609 72.5879 76.0719C72.8971 75.683 73.1258 75.2264 73.2418 74.7324C73.308 74.49 73.3372 74.2373 73.3458 73.9835C73.3438 73.8585 73.3481 73.7316 73.338 73.6019C73.338 73.6019 72.7146 67.7921 72.5935 66.7799C72.4743 65.7741 72.9681 65.4368 73.3281 65.3194C73.9981 65.099 74.3824 65.6098 74.7416 66.0092C75.1007 66.4086 78.9626 70.7297 78.9626 70.7297C79.4296 71.2447 80.0589 71.6154 80.7355 71.7491C81.4013 71.8928 82.1522 71.7888 82.7328 71.5173C83.1677 71.3296 83.6025 71.1418 84.0356 70.9477C84.9009 70.5804 85.7725 70.2114 86.6611 69.8305C87.0923 69.6298 87.7381 69.3256 88.3858 69.0279L88.6256 68.9171L88.7455 68.8618L88.8144 68.842C88.8583 68.8293 88.9004 68.8103 88.9362 68.793C88.9757 68.7887 89.0151 68.7843 89.0528 68.7735C89.1324 68.7436 89.2019 68.7725 89.2664 68.761C89.3303 68.7706 89.3941 68.7801 89.4454 68.7933C89.7551 68.8788 90.0673 69.1382 90.2012 69.4627C90.344 69.7707 90.3277 70.0685 90.1477 70.4343Z" fill="#10A6ED" fill-opacity="0.2"/>
<path d="M30.6149 32.7677C36.3483 34.3928 40.2241 40.5121 44.6977 44.1479C48.5698 47.2995 53.1008 50.0361 58.1428 50.6835C63.4586 51.3624 68.2049 49.2882 72.8168 46.8395C75.86 45.2248 79.4366 43.266 83.0213 42.6028C82.1929 43.5256 81.6025 44.7261 81.4154 46.105C81.1094 48.3852 83.0117 50.0454 85.2547 49.5309C87.1273 49.1049 88.8036 47.4897 90.1261 45.8045C89.9984 49.689 91.2532 53.767 92.8266 57.1734C97.4323 67.1629 106.564 73.4832 117.791 72.3814C127.812 71.3991 136.716 64.2339 138.576 54.1215C140.807 41.9876 132.2 31.0026 120.97 27.522C120.911 27.5 120.853 27.4969 120.795 27.4843C120.741 27.4666 120.686 27.4394 120.632 27.4217C111.691 25.0361 102.031 29.0842 95.5397 35.3219C94.6953 36.1374 93.8671 37.0175 93.1168 37.9602C93.0368 36.4779 92.717 35.0174 92.0256 33.6788C91.0777 31.8416 88.9851 29.5898 86.7108 30.6634C84.007 31.9413 84.127 35.6987 84.9051 38.0867C85.0954 38.6782 85.3507 39.2103 85.6594 39.708C77.1855 39.5976 69.2735 48.0775 60.5734 48.1632C54.4198 48.2278 49.0195 44.4905 44.6059 40.5678C40.2814 36.7255 36.8083 31.7726 31.0115 30.1308C29.3732 29.6713 28.9902 32.3019 30.6149 32.7677ZM87.2061 45.0263C86.7952 45.4518 84.0188 48.115 84.1581 46.01C84.2895 44.0104 86.7421 42.5561 88.3661 43.6916C88.0061 44.1494 87.6211 44.5957 87.2061 45.0263ZM96.3553 38.2471C102.209 31.8997 111.564 27.8045 120.103 30.021C128.909 32.8394 136.083 40.3503 136.266 49.9847C136.453 59.571 129.127 67.4827 119.961 69.3676C110.071 71.3993 101.154 66.8502 96.3036 58.1937C94.235 54.5004 92.6802 50.0519 92.7987 45.7647C92.8859 42.7585 94.358 40.4203 96.3553 38.2471ZM87.4658 37.3897C87.0688 36.3225 86.5579 32.4137 88.4871 33.3824C90.5513 34.4169 90.6454 37.7924 90.3888 40.1811C89.015 39.754 88.0024 38.8357 87.4658 37.3897Z" fill="#10A6ED" fill-opacity="0.2"/>
<path d="M187.956 172.222C187.791 172.499 187.635 172.813 187.479 173.126C187.526 173.074 188.519 171.293 187.956 172.222Z" fill="#10A6ED" fill-opacity="0.2"/>
<path d="M-20.8284 156.335C-20.1066 156.655 -19.4925 156.335 -18.8234 156.023C-18.1091 155.682 -17.4199 155.281 -16.7547 154.849C-15.4903 154.019 -14.2099 153.086 -13.2217 151.929C-11.1972 149.571 -9.96528 146.514 -9.42238 143.49C-9.09765 141.687 -8.99819 139.814 -9.02993 137.986C-7.39074 139.518 -5.83571 141.127 -4.44401 142.88C-3.04632 144.654 -1.91408 146.535 -0.884067 148.535C-2.07111 147.679 -3.50144 146.743 -5.04876 146.984C-6.54501 147.218 -7.87753 148.128 -8.70556 149.367C-9.49149 150.541 -9.83099 152.001 -9.4955 153.381C-9.13905 154.859 -8.39507 156.34 -7.48967 157.563C-6.45623 158.967 -5.0089 159.937 -3.57759 160.903C-5.75453 160.776 -7.91327 160.395 -10.0597 160.981C-11.1224 161.271 -12.2732 161.572 -13.2089 162.172C-14.1827 162.798 -14.9023 163.675 -15.4748 164.667C-16.0153 165.613 -16.2773 166.629 -16.0157 167.699C-15.7441 168.803 -15.2823 169.882 -14.615 170.805C-13.3785 172.52 -11.3014 173.594 -9.23874 173.958C-7.9431 174.188 -6.6193 174.252 -5.31732 174.029C-3.98731 173.797 -2.67516 173.345 -1.39309 172.946C-3.14969 174.573 -4.93335 176.237 -6.37973 178.151C-7.04428 179.034 -7.66183 180.002 -7.952 181.079C-8.25924 182.229 -8.03869 183.288 -7.50368 184.331C-6.58668 186.123 -4.13207 187.27 -2.16132 187.261C-0.970657 187.258 0.226337 186.801 1.30418 186.325C2.36098 185.856 3.33075 185.269 4.18449 184.489C6.16552 182.693 7.484 180.387 8.1908 177.827C9.42471 181.779 10.7671 186.664 15.5302 187.471C17.4927 187.803 19.7354 186.971 20.9933 185.405C22.2511 183.839 22.7324 181.578 22.3362 179.644C22.0997 178.477 21.712 177.286 21.171 176.222C20.63 175.157 19.8246 174.229 18.971 173.398C20.8103 173.751 22.8058 174.066 24.6747 173.755C26.4554 173.454 28.5226 172.883 29.9274 171.696C31.2771 170.556 32.1116 168.757 31.6241 167.008C31.1507 165.307 30.0673 163.781 28.7703 162.595C27.1851 161.146 25.1859 160.342 23.0551 160.059C24.8263 159.09 26.3183 157.758 27.48 156.175C27.9812 155.489 28.4655 154.612 28.6794 153.745C28.9165 152.773 28.6598 151.853 28.348 150.927C28.0312 150.009 27.5982 149.162 26.9428 148.439C26.3164 147.738 25.4816 147.316 24.6146 146.993C22.6944 146.279 20.7603 146.865 18.9592 147.676C16.7765 148.664 15.1121 150.189 13.6517 152.054C13.9002 150.356 14.0427 148.659 13.7164 146.969C13.4121 145.407 12.8716 143.658 11.8039 142.451C10.7603 141.275 9.18031 141.007 7.69996 141.402C6.04434 141.847 4.42867 142.432 3.05501 143.489C1.68636 144.537 0.850902 146.358 1.12506 148.079C0.0510199 146.031 -1.02909 144.067 -2.44476 142.231C-3.82541 140.436 -5.33936 138.786 -6.96951 137.206C-5.13487 137.093 -3.37908 136.627 -1.61728 136.128C0.111476 135.646 1.69011 135.012 3.22391 134.09C4.7056 133.197 6.14332 132.205 7.41392 131.027C8.69154 129.846 9.83712 128.471 10.8635 127.077C10.8144 127.144 10.7653 127.21 10.7162 127.277C11.1061 126.759 11.6663 126.199 11.5706 125.496C11.4601 124.662 10.4359 124.294 9.73106 124.112C7.9469 123.661 5.38109 123.976 2.82901 124.71C-4.21023 126.732 -8.49159 132.938 -9.87366 134.547C-10.9024 133.608 -11.9462 132.696 -12.9971 131.786C-13.5105 131.346 -14.0219 130.913 -14.5523 130.493C-15.0227 130.124 -15.5462 129.755 -16.1263 130.192C-17.3677 131.129 -15.5559 132.204 -14.9264 132.731C-13.8235 133.664 -12.1892 134.994 -11.1274 135.969C-11.1274 135.969 -16.1193 140.098 -19.9194 146.896C-21.4825 149.619 -22.4309 152.421 -21.7696 154.723C-21.6538 155.285 -21.4 156.063 -20.8304 156.328C-20.8354 156.337 -20.8354 156.337 -20.8284 156.335ZM-2.245 171.143C-3.64125 171.567 -5.1127 172.125 -6.58079 172.193C-7.97979 172.264 -9.51577 172.043 -10.7751 171.41C-12.0524 170.769 -13.0532 169.874 -13.6521 168.555C-13.902 168.002 -14.2219 167.259 -14.1464 166.65C-14.0698 166.018 -13.6608 165.381 -13.2809 164.88C-12.3858 163.69 -11.0347 163.294 -9.66351 162.915C-8.35543 162.554 -7.00353 162.557 -5.66477 162.7C-4.27794 162.851 -2.861 162.896 -1.4712 163.084C-0.80834 163.172 -0.147473 163.253 0.516406 163.318C0.695644 163.335 1.49778 163.3 1.60084 163.421C1.68189 163.518 1.55011 164.354 1.54498 164.521C1.55038 165.385 1.6549 166.251 1.83856 167.102C1.9144 167.472 2.00426 167.837 2.10114 168.201C2.14607 168.384 2.19803 168.565 2.24997 168.745C2.27195 168.822 2.45691 169.228 2.43083 169.296C2.38066 169.438 1.56434 169.688 1.40907 169.755C1.05848 169.908 0.698869 170.057 0.346274 170.203C-0.493147 170.557 -1.33053 170.866 -2.20493 171.124C-1.97356 171.058 -2.08574 171.09 -2.245 171.143ZM6.6139 173.183C6.60776 173.373 6.62664 173.571 6.6295 173.766C6.62754 173.707 6.62759 173.654 6.62849 173.789C6.6254 173.91 6.62944 173.872 6.62548 173.805C6.64762 176.471 6.01881 179.197 4.36296 181.359C3.55208 182.42 2.63215 183.339 1.48005 184.031C0.425134 184.666 -1.00331 185.294 -2.26005 185.279C-3.41064 185.263 -4.94632 184.62 -5.61458 183.668C-6.41688 182.513 -6.11465 181.372 -5.43691 180.244C-4.01926 177.887 -1.75774 175.957 0.244368 174.102C0.790486 173.599 1.36062 173.127 1.93075 172.654C2.2564 172.387 2.57102 172.109 2.89267 171.828C3.02494 171.707 3.53005 171.141 3.68927 171.14C3.75837 171.143 4.04455 171.452 4.11161 171.501C4.26974 171.628 4.43288 171.747 4.59602 171.866C4.89328 172.082 5.19556 172.288 5.51589 172.452C5.80018 172.597 6.21471 172.666 6.46093 172.836C6.68514 172.982 6.62412 172.902 6.6139 173.183ZM20.4341 180.341C20.448 180.442 20.447 180.465 20.441 180.444C20.5612 181.787 20.2156 183.385 19.2486 184.378C18.7194 184.914 18.0974 185.206 17.3812 185.434C16.616 185.676 15.9371 185.585 15.1762 185.367C12.1035 184.473 11.2219 180.796 10.3686 178.143C9.80506 176.392 9.26758 174.627 8.67599 172.885C9.36105 172.733 10.0832 172.578 10.7303 172.295C11.0128 172.168 11.2442 171.944 11.5267 171.817C11.7621 171.712 12.0124 171.738 12.2618 171.787C13.5374 172 14.9179 172.605 15.9448 173.379C17.0297 174.197 18.1605 175.227 18.9248 176.355C19.6801 177.478 20.1548 178.84 20.4092 180.175C20.3982 180.163 20.4121 180.212 20.4341 180.341ZM29.8049 168.02C29.8029 168.013 29.8029 168.013 29.8049 168.02C29.8029 168.013 29.8029 168.013 29.8049 168.02ZM25.2784 162.672C25.3034 162.68 25.3124 162.685 25.3144 162.692C26.5627 163.259 27.5555 164.073 28.415 165.137C29.0173 165.859 29.9436 167.235 29.7506 168.359C29.5545 169.5 28.6897 170.32 27.6739 170.8C26.538 171.337 25.1527 171.773 23.8929 171.879C22.6491 171.988 21.3694 171.813 20.1509 171.614C18.9073 171.406 17.6668 171.13 16.5155 170.61C15.9389 170.347 15.3763 170.079 14.8418 169.751C14.6666 169.643 14.2392 169.45 14.1412 169.267C14.0582 169.11 14.407 168.686 14.5203 168.473C15.0918 167.398 15.353 166.246 15.425 165.044C15.4624 164.461 15.4608 163.874 15.4082 163.294C15.3943 163.087 15.3632 163.111 15.5015 163.011C15.5827 162.95 15.807 162.939 15.9121 162.908C16.2507 162.819 16.5832 162.708 16.9158 162.598C17.6369 162.36 18.268 162.179 19.0191 162.099C19.7471 162.018 20.4732 161.93 21.2002 161.924C22.5341 161.917 23.8307 162.177 25.0801 162.616C24.94 162.551 24.8629 162.521 25.2784 162.672ZM14.8281 153.771C15.7683 152.553 16.7636 151.288 18.053 150.413C19.3374 149.547 21.0905 148.675 22.6707 148.628C24.1909 148.582 25.5901 149.543 26.213 150.892C26.493 151.497 26.8639 152.392 26.7853 153.069C26.7107 153.761 26.2625 154.5 25.8526 155.054C25.8676 155.027 25.8696 155.034 25.8135 155.103C25.8235 155.085 25.8406 155.065 25.8526 155.054C25.8355 155.074 25.7984 155.13 25.7694 155.161C25.6792 155.269 25.598 155.383 25.5078 155.492C25.3685 155.667 25.2221 155.845 25.0738 156.015C24.724 156.41 24.3483 156.766 23.9345 157.096C23.0968 157.773 22.1571 158.306 21.1924 158.779C20.2258 159.245 19.2541 159.667 18.2434 160.033C17.1767 160.415 16.048 160.633 14.9632 160.953C14.7744 160.269 14.5416 159.591 14.1054 159.023C13.8943 158.738 13.6572 158.467 13.393 158.234C13.2618 158.121 13.1277 158.024 12.9846 157.922C12.7364 157.745 12.7724 157.818 12.8467 157.548C13.1891 156.283 13.946 155.034 14.6978 153.952C14.6998 153.959 14.7249 153.914 14.8281 153.771ZM3.07696 147.819C3.07398 147.782 3.07199 147.775 3.07199 147.775C2.83657 145.08 5.77943 144.016 7.90182 143.399C8.42065 143.25 8.96952 143.1 9.50916 143.261C10.0898 143.433 10.4771 143.909 10.7661 144.413C11.0602 144.908 11.217 145.481 11.3888 146.026C11.5816 146.671 11.7995 147.324 11.8621 147.991C11.9794 149.192 11.8944 150.376 11.7123 151.565C11.5202 152.824 11.4221 154.095 11.1999 155.356C11.1446 155.665 11.0753 155.979 11.011 156.283C10.9849 156.404 10.9608 156.531 10.9276 156.654C10.9156 156.717 10.9015 156.774 10.8895 156.838C10.9063 157.029 10.8352 157.072 10.6801 156.981C10.4317 157.014 10.0913 156.886 9.83596 156.869C9.54157 156.849 9.24917 156.835 8.95576 156.844C8.33187 156.865 7.71395 156.959 7.108 157.096C6.91471 157.136 6.83053 157.213 6.72046 157.094C6.65242 157.016 6.62355 156.783 6.57956 156.683C6.4526 156.373 6.2976 156.071 6.1426 155.77C4.90062 153.296 3.67576 150.696 3.10991 147.96C3.11688 148.011 3.11089 147.99 3.07696 147.819ZM7.1376 159.128C8.98154 158.598 12.2611 158.574 13.1222 161.572C13.9833 164.569 13.2657 169.549 9.74612 170.56C6.2265 171.571 4.60841 169.927 3.9711 167.709C3.33378 165.49 2.83973 160.362 7.1376 159.128ZM1.64373 153.795C1.70076 153.861 1.75078 153.929 1.80782 153.996C1.78181 153.958 1.74879 153.922 1.71777 153.894C2.77929 155.238 3.68151 156.687 4.75506 158.02C4.74304 158.031 4.72503 158.021 4.71602 158.016C4.71598 158.069 4.65287 158.087 4.54767 158.17C4.45249 158.235 4.36633 158.305 4.28016 158.375C4.08177 158.53 3.88937 158.706 3.713 158.884C3.35825 159.235 3.02052 159.618 2.74384 160.028C2.6055 160.234 2.48319 160.442 2.37888 160.66C2.2776 160.863 2.22731 161.163 2.093 161.33C1.97072 161.485 2.10194 161.44 1.91068 161.435C1.80453 161.435 1.6634 161.34 1.5703 161.307C1.31201 161.2 1.05874 161.085 0.805474 160.969C-1.20268 160.055 -3.09858 159.004 -4.79594 157.587C-4.52472 157.818 -5.07616 157.351 -4.79594 157.587C-6.05095 156.547 -6.97806 154.878 -7.45163 153.336C-7.9152 151.827 -7.29215 150.165 -5.88162 149.369C-5.15031 148.955 -4.44421 148.798 -3.67841 149.165C-2.98267 149.5 -2.31604 149.918 -1.70953 150.391C-0.427454 151.393 0.698223 152.643 1.72677 153.899C1.69175 153.856 1.66774 153.825 1.64373 153.795ZM3.22719 126.651C5.77926 125.917 7.69514 125.638 9.19595 126.028C8.23169 127.321 7.13927 128.591 5.95283 129.692C4.67721 130.879 3.19348 131.817 1.70277 132.705C0.271171 133.56 -1.28731 134 -2.88285 134.444C-4.55551 134.909 -6.18399 135.211 -7.92247 135.289C-7.65789 134.995 -2.08029 128.175 3.22719 126.651ZM-19.8635 154.198C-19.8834 154.023 -19.8725 154.088 -19.8635 154.146C-20.1137 151.161 -18.4955 148.392 -17.0147 145.912C-16.2246 144.593 -11.5369 138.639 -10.5007 137.543C-10.576 140.636 -11.5526 145.216 -13.0056 148.005C-13.7195 149.377 -14.5706 150.615 -15.749 151.639C-16.9774 152.699 -18.373 153.627 -19.8346 154.326C-19.8466 154.284 -19.8515 154.24 -19.8635 154.198Z" fill="#10A6ED" fill-opacity="0.2"/>
<path d="M31.2855 116.499C49.3854 111.299 59.8414 92.4147 54.642 74.3148C49.4425 56.2149 30.558 45.7589 12.4581 50.9583C-5.64178 56.1578 -16.0978 75.0423 -10.8984 93.1422C-5.69893 111.242 13.1913 121.696 31.2855 116.499ZM13.2508 53.7178C13.2564 53.7162 13.262 53.7146 13.2677 53.7129C10.6903 59.1719 3.96627 75.7468 9.00167 91.1322C9.25787 91.8755 9.44822 92.1134 9.85855 92.0138C10.4192 91.8223 10.9832 91.642 11.5101 91.4602C11.9203 91.3179 11.9923 91.0168 11.8315 90.5631C6.77016 75.045 13.8473 58.2772 16.4232 52.9833C28.3536 50.8607 40.2459 55.9061 47.1377 65.3813C45.9699 67.6188 43.83 71.7145 43.3524 72.5772C30.9657 94.9486 17.7684 93.6371 18.4948 96.1657C18.5951 96.5149 20.2811 97.0364 21.7792 96.6061C26.3745 95.286 36.6159 90.6371 46.2588 73.2298C47.4268 71.1202 48.319 69.1326 48.8211 67.952C50.112 70.1538 51.148 72.5508 51.8825 75.1075C54.3576 83.7238 52.9353 92.5453 48.6806 99.6992C46.801 100.605 43.7453 101.916 39.7131 103.074C28.7991 106.209 22.452 101.601 19.6193 102.415C19.3264 102.499 19.1981 102.816 19.2725 103.075C19.5977 104.207 20.3587 104.543 21.0112 104.904C21.6636 105.266 31.1855 108.511 40.0384 105.968C41.9813 105.41 43.9763 104.757 45.3479 104.29C41.5312 108.66 36.4736 112.021 30.4928 113.739C27.1477 114.7 23.7719 115.066 20.4734 114.917C19.6415 113.4 17.9239 110.052 16.9242 106.572C16.7899 106.105 16.561 105.902 16.1443 106.022C15.6093 106.176 15.0502 106.373 14.4814 106.536C14.0309 106.666 14.066 106.979 14.2827 107.733C15.2113 110.966 16.5105 113.324 17.3389 114.616C10.5068 113.604 4.18084 110.343 -0.599775 105.394C0.395458 105.145 1.4735 104.823 2.62701 104.382C3.36223 104.097 3.59136 103.897 3.4765 103.498C3.26404 102.949 3.06518 102.384 2.86806 101.868C2.71455 101.461 2.41106 101.402 1.96059 101.574C0.396034 102.176 -1.22906 102.63 -2.70142 102.98C-5.11472 99.9058 -6.99353 96.3367 -8.13728 92.3551C-8.75041 90.2208 -9.12369 88.0724 -9.27323 85.9389C-7.86753 88.4979 -4.92337 92.4865 0.789104 95.6494C1.47779 96.0308 1.77805 96.0786 2.01337 95.7306C2.29835 95.2159 2.60191 94.7019 2.87084 94.2162C3.08357 93.832 2.93346 93.5642 2.50736 93.3331C-5.16243 89.0864 -8.14394 82.6334 -9.11452 79.8702C-7.60013 67.8461 0.883866 57.2704 13.2508 53.7178Z" fill="#10A6ED" fill-opacity="0.2"/>
<path d="M118.441 111.169C118.54 111.074 118.639 110.979 118.738 110.884C121.709 108.168 118.51 111.116 118.441 111.169Z" fill="#10A6ED" fill-opacity="0.2"/>
<path d="M126.159 184.346C124.124 183.204 128.183 185.451 126.159 184.346V184.346Z" fill="#10A6ED" fill-opacity="0.2"/>
<path d="M155.55 185.254C155.482 185.821 155.981 185.951 156.452 185.98C156.835 185.706 156.549 185.514 155.55 185.254Z" fill="#10A6ED" fill-opacity="0.2"/>
<path d="M83.7037 120.181C81.0016 117.874 74.6601 113.431 69.6743 110.724C69.4913 110.636 69.3929 110.574 69.0762 110.429C68.7913 110.313 68.4741 110.216 68.1258 110.168C67.4425 110.069 66.6223 110.161 65.9081 110.586C65.5509 110.799 65.2404 111.068 64.9825 111.422C64.7245 111.775 64.5529 112.224 64.4995 112.624C64.4036 113.448 64.6049 114.004 64.7259 114.404C64.8711 114.824 65.0086 115.148 65.1483 115.493L65.5689 116.512C65.8538 117.19 66.1483 117.861 66.4513 118.532C66.7505 119.198 67.063 119.862 67.3803 120.522L67.7317 121.233C67.7476 121.291 67.855 121.393 67.7596 121.432C67.6819 121.424 67.6379 121.341 67.5723 121.3L67.074 120.923C66.6926 120.64 66.3103 120.366 65.9232 120.096C65.1444 119.56 64.3457 119.049 63.5349 118.57C62.7155 118.091 61.9098 117.649 61.0381 117.212C60.5846 116.997 60.0918 116.782 59.5078 116.649C58.9325 116.517 58.2345 116.477 57.5583 116.697C56.8697 116.912 56.2815 117.384 55.9095 117.918C55.5241 118.455 55.307 119.052 55.2078 119.648C55.1008 120.235 55.1384 120.902 55.2783 121.461C55.4135 122.023 55.6316 122.542 55.8855 123.008C56.4051 123.954 56.9865 124.675 57.596 125.421C58.2072 126.149 58.8284 126.822 59.4535 127.5C59.623 127.678 59.7887 127.852 59.9582 128.03C58.9149 127.393 57.843 126.78 56.74 126.216C55.905 125.805 55.0557 125.406 54.1468 125.079C53.256 124.745 52.2616 124.489 51.2067 124.4C50.7858 124.38 50.3283 124.334 49.7688 124.347C49.4891 124.354 49.1809 124.384 48.8446 124.477C48.5091 124.561 48.1468 124.738 47.8436 124.978C47.5443 125.223 47.305 125.521 47.1498 125.807C46.9813 126.095 46.8516 126.431 46.7832 126.764C46.6416 127.434 46.7219 128.066 46.8627 128.616C47.1664 129.715 47.6571 130.558 48.2639 131.416C48.2911 131.45 48.3416 131.511 48.3416 131.511L48.3493 131.521C48.3493 131.521 47.0987 130.951 45.8518 130.647L45.096 130.488C44.8379 130.453 44.5721 130.409 44.3131 130.383C43.8029 130.341 43.29 130.324 42.7776 130.347C41.7528 130.392 40.7323 130.569 39.7496 130.889C39.2578 131.053 38.7721 131.244 38.3204 131.486L37.6381 131.854C37.4162 131.98 37.1994 132.141 36.9804 132.28C36.1262 132.884 35.3233 133.627 34.7261 134.535C33.5012 136.352 33.1208 138.572 33.2175 140.601C33.325 142.652 33.7887 144.586 34.4329 146.46C35.5364 149.575 37.1118 151.987 38.6414 153.772L40.1374 155.369C40.8044 156.02 41.4394 156.555 42.0172 157.01C43.1761 157.885 44.0857 158.377 44.2235 158.265C44.4325 158.094 41.6541 155.722 38.7823 150.638C38.1243 149.464 36.6333 146.777 35.8385 143.497C35.448 141.875 35.2095 140.129 35.4492 138.571C35.5667 137.793 35.7756 137.06 36.0873 136.433C36.4153 135.816 36.7938 135.261 37.2369 134.844C38.4438 133.683 40.1036 132.873 41.8421 132.625C42.7051 132.498 43.6267 132.481 44.4856 132.611C45.3368 132.731 46.2194 133.016 47.0912 133.365C48.8377 134.077 50.5417 135.037 52.2017 136.089C52.6155 136.353 53.0246 136.62 53.4327 136.897L54.0446 137.316L54.3311 137.502C54.4903 137.609 54.735 137.734 55.0112 137.762C55.2827 137.793 55.5724 137.731 55.7935 137.613C56.2404 137.375 56.5122 136.971 56.5605 136.448C56.5818 136.193 56.5194 135.903 56.3935 135.681C56.2732 135.447 56.0691 135.265 56.0691 135.265C55.8698 135.079 55.6752 134.89 55.4742 134.721C55.0699 134.362 54.6574 134.042 54.2489 133.726C52.6089 132.476 46.918 128.674 49.2554 126.764C50.158 126.026 53.6304 127.307 54.4775 127.685C56.1757 128.444 57.8206 129.428 59.4055 130.447C61.7148 131.934 63.9632 133.551 66.1654 135.237L66.9912 135.869L67.4037 136.189L67.6057 136.349L67.654 136.389C67.6173 136.363 67.8028 136.513 67.9741 136.587C68.3401 136.763 68.8736 136.747 69.2165 136.546C69.5671 136.354 69.8017 136.059 69.9155 135.665C70.0371 135.281 69.9329 134.756 69.6978 134.449C69.6482 134.379 69.5814 134.306 69.5262 134.249L69.502 134.229L69.4546 134.18L69.3635 134.088L68.9908 133.72L68.2406 132.986L65.2674 130.037C63.3075 128.065 61.3149 126.073 59.545 124.034C58.697 123.016 57.8503 121.941 57.6105 120.988C57.5446 120.733 57.5197 120.548 57.525 120.321C57.5342 120.1 57.5779 119.882 57.6545 119.685C57.8123 119.286 58.0455 119.048 58.292 118.981C58.5412 118.889 58.9681 118.936 59.4847 119.132C59.9887 119.322 60.592 119.653 61.1797 119.965C62.3457 120.596 63.4875 121.295 64.5925 122.056L65.4149 122.635L65.8166 122.933L66.3991 123.384C66.8327 123.711 67.4099 124.213 67.9143 124.617L68.6832 125.209C68.8873 125.303 69.0591 125.329 69.2494 125.388L69.3849 125.427L69.476 125.432L69.6543 125.437C69.7846 125.441 69.871 125.45 70.0277 125.409C70.3567 125.346 70.8252 125.066 71.0525 124.714C71.1743 124.543 71.237 124.397 71.2647 124.295L71.3435 123.945C71.342 123.614 71.3922 123.288 71.1293 122.694L70.267 121.038L69.622 119.735C69.3565 119.168 69.0901 118.609 68.8245 118.042C68.3059 116.913 67.8188 115.774 67.3576 114.638C67.1197 114.056 66.8956 113.51 66.8626 113.189C66.8484 113.026 66.861 112.944 66.8826 112.903C66.9003 112.857 66.9522 112.775 67.055 112.707C67.2346 112.568 67.5338 112.497 67.8593 112.556C67.9409 112.569 68.0168 112.594 68.0928 112.619C68.1851 112.654 68.2024 112.656 68.3595 112.742L69.1474 113.143C73.3255 115.298 76.9487 117.811 80.227 120.155C82.4763 121.763 83.9221 122.863 84.7415 123.429C85.2252 123.778 85.4858 123.961 85.5808 123.884C85.6815 123.793 84.9875 121.548 83.7037 120.181Z" fill="#10A6ED" fill-opacity="0.2"/>
</g>
<defs>
<clipPath id="clip0">
<rect x="130" y="140.371" width="328" height="335" rx="32" fill="white"/>
</clipPath>
<clipPath id="clip1">
<rect x="328" y="335.371" width="328" height="335" rx="32" transform="rotate(-180 328 335.371)" fill="white"/>
</clipPath>
</defs>
</svg>
