<svg width="97" height="80" viewBox="0 0 97 80" fill="none" xmlns="http://www.w3.org/2000/svg">
<path d="M67.4628 78.5266C65.7888 74.5639 67.4676 69.6106 67.4868 65.446C67.5061 61.8392 66.9962 58.0496 65.0865 54.9189C63.071 51.6199 59.7712 49.8886 56.3223 48.4026C54.0471 47.4216 51.3389 46.2963 49.3523 44.5794C50.2422 44.6275 51.1802 44.4159 52.0364 43.8965C53.4506 43.0357 53.5228 41.2131 52.224 40.184C51.1417 39.3231 49.4822 39.1115 47.9429 39.1308C50.1748 37.4428 51.8921 34.8892 53.0898 32.4606C56.6061 25.3432 56.0289 17.3409 50.3528 11.5219C45.2876 6.32816 37.2642 4.56323 30.7656 8.09789C22.9682 12.3395 20.6978 22.1596 23.81 30.0561C23.8244 30.0994 23.8485 30.133 23.8677 30.1715C23.8822 30.21 23.8918 30.2532 23.9062 30.2917C26.5999 36.404 33.2188 40.006 39.6356 40.8332C40.4726 40.939 41.3385 41.0063 42.2043 41.0015C41.4106 41.718 40.7372 42.5596 40.2994 43.5551C39.6982 44.9209 39.3807 47.1186 41.0066 47.9121C42.9403 48.8547 44.9894 47.085 45.9755 45.5653C46.2208 45.1902 46.4036 44.8055 46.5431 44.4063C50.2999 49.225 58.612 49.8357 62.5804 54.6929C65.3896 58.1266 65.7311 62.8587 65.5243 67.1195C65.3222 71.2938 64.1149 75.4921 65.8081 79.498C66.2891 80.6282 67.9342 79.6519 67.4628 78.5266ZM48.8232 41.1265C49.2465 41.165 51.9883 41.5209 50.7473 42.3961C49.5687 43.2281 47.6495 42.5067 47.5533 41.0784C47.9718 41.0736 48.3951 41.0881 48.8232 41.1265ZM40.9055 39.049C34.7148 38.6306 28.2065 35.221 25.5994 29.4117C23.2087 23.1791 24.1804 15.7395 29.4909 11.2719C34.7725 6.82349 42.5025 7.36211 47.688 11.6662C53.2822 16.3118 54.7542 23.3907 52.0941 30.0416C50.9589 32.879 49.1695 35.7692 46.7163 37.6448C44.9942 38.9576 43.022 39.1885 40.9055 39.049ZM44.4314 44.44C44.0129 45.1469 42.0552 47.2052 41.7281 45.6807C41.3769 44.0504 43.2241 42.4683 44.6768 41.5305C45.0568 42.4971 44.999 43.483 44.4314 44.44Z" fill="white"/>
<path d="M36.3809 67.1386C36.3809 72.5314 41.5769 78.5217 49.7899 78.5217C58.0029 78.5217 59.854 71.7327 59.6624 71.5412C59.5423 71.4211 57.2138 77.2522 49.7899 77.2522C44.4055 77.2522 37.6506 73.6288 37.6506 67.1386C37.6506 61.6354 43.3728 55.0769 47.1042 55.0769C50.8389 55.0769 55.7426 58.46 55.7426 64.0152C55.7426 69.5704 50.0432 72.1613 47.1107 72.1613C43.6716 72.1613 41.4113 69.184 41.4113 66.5996C41.4113 63.0542 44.3243 60.3172 47.4647 60.3172C50.6051 60.3172 52.271 62.7003 52.271 64.8139C52.271 66.8172 49.9815 68.8691 47.3932 68.8691C45.7337 68.8691 44.36 68.5509 44.36 67.2782C44.36 65.6776 46.3833 64.5217 47.4614 64.5217C48.5396 64.5217 49.4002 65.3269 49.4002 66.1613C49.4002 66.999 48.6143 67.5185 48.6143 67.5185C48.8644 67.7685 50.0627 66.6483 50.0627 65.4665C50.0627 64.736 49.5788 63.249 47.4614 63.249C45.0972 63.249 43.0903 65.7068 43.0903 67.275C43.0903 68.8431 44.5776 70.1353 47.3932 70.1353C50.2088 70.1353 53.5408 68.0802 53.5408 64.8107C53.5408 61.5412 50.8616 59.0445 47.4614 59.0445C43.9963 59.0445 40.1383 61.8204 40.1383 66.5964C40.1383 69.8009 42.9474 73.4275 47.1074 73.4275C51.6995 73.4275 57.0092 69.6581 57.0092 64.012C57.0092 59.1354 53.0504 53.8042 47.101 53.8042C42.4765 53.8074 36.3809 61.447 36.3809 67.1386Z" fill="white"/>
<path d="M16.2754 16.4435C17.0424 15.5498 17.3597 14.4341 17.0635 13.276C16.8467 12.4352 15.8681 11.8482 15.0271 12.1232C14.1597 12.4034 13.6413 13.2601 13.8741 14.1591C13.9481 14.4499 13.8318 13.7149 13.8741 14.1749C13.9005 14.4711 13.9746 13.7995 13.8899 14.1009C13.8793 14.1485 13.8688 14.1908 13.8529 14.2331C13.8106 14.3547 13.837 14.2966 13.9322 14.0533C13.9058 14.1115 13.8741 14.1644 13.8423 14.2173C13.7471 14.36 13.7736 14.323 13.9322 14.1009C13.3663 14.7566 13.2394 15.8037 13.9322 16.4382C14.5564 17.0146 15.6725 17.1468 16.2754 16.4435Z" fill="white"/>
<path d="M32.6485 56.5558C33.4154 55.6621 33.7328 54.5464 33.4366 53.3883C33.2197 52.5475 32.2412 51.9605 31.4002 52.2355C30.5327 52.5158 30.0144 53.3724 30.2471 54.2714C30.3212 54.5622 30.2048 53.8272 30.2471 54.2873C30.2736 54.5834 30.3476 53.9118 30.263 54.2132C30.2524 54.2608 30.2418 54.3031 30.226 54.3454C30.1837 54.467 30.2101 54.4089 30.3053 54.1656C30.2788 54.2238 30.2471 54.2767 30.2154 54.3296C30.1202 54.4723 30.1466 54.4353 30.3053 54.2132C29.7393 54.8689 29.6124 55.916 30.3053 56.5505C30.9294 57.1269 32.0455 57.2591 32.6485 56.5558Z" fill="white"/>
<path d="M78.3649 51.7708C77.1873 51.7848 76.1397 52.283 75.4654 53.27C74.9771 53.988 75.1822 55.1105 75.9439 55.5606C76.7271 56.0271 77.7128 55.8509 78.2343 55.0826C78.4039 54.835 77.9286 55.4077 78.2463 55.0722C78.4512 54.8568 77.8979 55.2446 78.1802 55.1091C78.2229 55.0857 78.2617 55.0657 78.3039 55.0497C78.4232 55.0011 78.3621 55.0197 78.1165 55.1088C78.1776 55.0902 78.2383 55.0791 78.299 55.0681C78.4691 55.0453 78.4238 55.0499 78.1522 55.0773C79.0184 55.0696 79.8886 54.4737 79.9078 53.5343C79.9287 52.685 79.2912 51.7594 78.3649 51.7708Z" fill="white"/>
<path d="M94.7379 26.3939C93.5604 26.4078 92.5128 26.906 91.8385 27.8931C91.3501 28.611 91.5552 29.7335 92.317 30.1837C93.1002 30.6502 94.0858 30.474 94.6074 29.7057C94.777 29.4581 94.3017 30.0307 94.6193 29.6952C94.8243 29.4799 94.271 29.8676 94.5532 29.7322C94.596 29.7087 94.6347 29.6887 94.677 29.6727C94.7962 29.6242 94.7351 29.6427 94.4895 29.7318C94.5507 29.7133 94.6114 29.7022 94.672 29.6911C94.8421 29.6684 94.7969 29.673 94.5253 29.7004C95.3914 29.6926 96.2617 29.0967 96.2809 28.1574C96.3018 27.308 95.6643 26.3825 94.7379 26.3939Z" fill="white"/>
<path d="M76.7965 5.07817C77.9719 5.00566 78.9934 4.45591 79.6178 3.43656C80.0698 2.69518 79.8091 1.58428 79.0259 1.1726C78.2205 0.745631 77.2448 0.970676 76.7621 1.76396C76.605 2.01972 77.0512 1.42412 76.7507 1.77501C76.5567 2.00031 77.09 1.5855 76.8149 1.7348C76.7733 1.76037 76.7356 1.78228 76.6942 1.80037C76.5775 1.85476 76.6377 1.83319 76.8785 1.73201C76.8183 1.75356 76.7583 1.76765 76.6982 1.78173C76.5295 1.81291 76.5745 1.80608 76.8443 1.76516C75.9797 1.81605 75.1401 2.45449 75.1677 3.39365C75.1891 4.24296 75.8719 5.13565 76.7965 5.07817Z" fill="white"/>
<path d="M2.30529 46.0093C3.48072 45.9368 4.5022 45.3871 5.12655 44.3677C5.57859 43.6263 5.31786 42.5154 4.53466 42.1038C3.72924 41.6768 2.75358 41.9018 2.27087 42.6951C2.11384 42.9509 2.56003 42.3553 2.25949 42.7062C2.0655 42.9315 2.59882 42.5167 2.32364 42.666C2.28213 42.6915 2.24444 42.7134 2.20304 42.7315C2.08631 42.7859 2.14645 42.7643 2.38727 42.6632C2.32712 42.6847 2.26708 42.6988 2.20704 42.7129C2.03828 42.7441 2.08326 42.7372 2.35313 42.6963C1.48845 42.7472 0.648936 43.3856 0.676509 44.3248C0.6979 45.1741 1.38067 46.0668 2.30529 46.0093Z" fill="white"/>
<path d="M69.8309 36.6149C70.2919 37.9287 69.4284 39.7431 67.0525 40.5766C64.6766 41.4101 60.9578 40.3465 60.627 41.0279C60.3564 41.5855 64.8875 43.1775 67.6599 42.2057C70.9492 41.0529 72.6576 38.3348 71.8554 36.0506C71.0533 33.7665 69.4966 33.6801 69.2285 33.4893C69.5743 33.4485 72.607 33.0905 71.8982 31.0719C71.2663 29.2763 68.6169 29.1461 68.6601 29.0548C68.7034 28.9634 73.2993 28.7983 72.3907 26.2096C71.7432 24.3646 68.2523 24.3456 68.2867 24.2738C68.3212 24.2021 72.9785 24.1422 72.0271 21.4331C71.1185 18.8444 63.2148 17.833 62.7772 17.7998C62.5027 17.7759 62.418 18.0443 62.4679 18.1962C62.5672 18.4693 63.0764 19.5383 64.0576 19.8102C66.301 20.416 69.968 21.8641 70.0715 22.1649C70.0901 22.218 70.0424 22.2508 69.9609 22.2803C68.6226 22.7488 66.5669 22.9033 65.7987 23.1721C65.3064 23.3453 64.7958 23.8071 65.0196 24.4446C65.158 24.8411 65.5832 25.0338 65.9126 25.193C66.242 25.3522 69.9953 26.344 70.2029 26.9388C70.2829 27.1655 69.8804 27.3647 69.7562 27.4104C68.287 27.924 62.8393 26.4424 62.053 26.7197C61.6102 26.8773 61.551 27.2679 61.7141 27.725C61.8043 27.9869 61.9416 28.2227 62.5478 28.4162C66.8838 29.8385 69.6823 31.395 69.8586 31.891C69.8851 31.9688 69.7301 32.0149 69.588 32.0691C67.7291 32.7216 65.9367 31.1866 65.027 31.5029C64.4996 31.6863 64.2911 32.0996 64.477 32.6375C64.5594 32.8747 64.6753 33.0161 65.0108 33.1827C65.4231 33.3673 69.0156 34.2918 69.8309 36.6149Z" fill="white"/>
</svg>
