<svg width="16" height="16" viewBox="0 0 16 16" fill="none" xmlns="http://www.w3.org/2000/svg">
<rect width="16" height="16" rx="8" fill="#E3F5FF"/>
<rect x="3" y="3" width="10" height="10" rx="5" fill="#FFCB1F"/>
<rect x="3" y="3" width="10" height="10" rx="5" fill="#FFCB1F"/>
</svg>
