<svg width="12" height="12" viewBox="0 0 18 18" fill="none" xmlns="http://www.w3.org/2000/svg">
<path fill-rule="evenodd" clip-rule="evenodd" d="M13.1314 11.9265C14.1872 10.5653 14.6848 8.85301 14.523 7.13795C14.3611 5.4229 13.5519 3.83392 12.2601 2.69428C10.9683 1.55465 9.29078 0.949963 7.56893 1.00324C5.84708 1.05653 4.21019 1.76377 2.99129 2.9811C1.77132 4.19927 1.06176 5.83679 1.00721 7.55995C0.952655 9.28311 1.55721 10.9622 2.69768 12.2551C3.83814 13.548 5.42869 14.3574 7.14519 14.5183C8.86169 14.6793 10.575 14.1796 11.9359 13.1212L11.9723 13.1593L15.564 16.7519C15.6426 16.8305 15.736 16.8929 15.8388 16.9355C15.9416 16.9781 16.0518 17 16.163 17C16.2743 17 16.3844 16.9781 16.4872 16.9355C16.59 16.8929 16.6834 16.8305 16.7621 16.7519C16.8407 16.6732 16.9031 16.5798 16.9457 16.477C16.9883 16.3742 17.0102 16.2641 17.0102 16.1528C17.0102 16.0416 16.9883 15.9314 16.9457 15.8286C16.9031 15.7258 16.8407 15.6325 16.7621 15.5538L13.1695 11.9621C13.1571 11.9499 13.1444 11.938 13.1314 11.9265ZM11.3736 4.17918C11.8517 4.64951 12.2319 5.20983 12.4923 5.82783C12.7527 6.44583 12.8882 7.10927 12.8909 7.77989C12.8937 8.45051 12.7636 9.11503 12.5082 9.73513C12.2528 10.3552 11.8772 10.9186 11.403 11.3928C10.9288 11.867 10.3654 12.2427 9.74532 12.498C9.12522 12.7534 8.46069 12.8835 7.79008 12.8807C7.11946 12.878 6.45601 12.7425 5.83802 12.4821C5.22002 12.2217 4.6597 11.8415 4.18937 11.3635C3.24946 10.4081 2.72513 9.12007 2.73059 7.77989C2.73605 6.43971 3.27085 5.15598 4.21851 4.20832C5.16617 3.26066 6.4499 2.72586 7.79008 2.7204C9.13025 2.71494 10.4183 3.23928 11.3736 4.17918Z" fill="white" stroke="white" stroke-width="0.666667"/>
</svg>
