{
  "project_info": {
    "project_number": "998257348773",
    "firebase_url": "https://ubycontroller.firebaseio.com",
    "project_id": "ubycontroller",
    "storage_bucket": "ubycontroller.appspot.com"
  },
  "client": [
    {
      "client_info": {
        "mobilesdk_app_id": "1:998257348773:android:e4cae7c980fd5e45f57d4c",
        "android_client_info": {
          "package_name": "com.ubyfol.uby_controller"
        }
      },
      "oauth_client": [
        {
          "client_id": "998257348773-ifh79jo1rae4hrli7agfgcohc39or6nm.apps.googleusercontent.com",
          "client_type": 3
        }
      ],
      "api_key": [
        {
          "current_key": "AIzaSyAOdfLjVK8_smZFVA1RmvyaWyYvnDIZXLU"
        }
      ],
      "services": {
        "appinvite_service": {
          "other_platform_oauth_client": [
            {
              "client_id": "998257348773-ifh79jo1rae4hrli7agfgcohc39or6nm.apps.googleusercontent.com",
              "client_type": 3
            }
          ]
        }
      }
    }
  ],
  "configuration_version": "1"
}