<svg width="20" height="16" viewBox="0 0 20 16" fill="none" xmlns="http://www.w3.org/2000/svg">
<path d="M10.43 0.100032C10.2676 0.029774 10.0895 0.00386392 9.91379 0.0249459C9.73811 0.0460278 9.57116 0.113347 9.43 0.220032L4.65 4.00003H1C0.734784 4.00003 0.48043 4.10539 0.292893 4.29293C0.105357 4.48046 0 4.73482 0 5.00003V11C0 11.2652 0.105357 11.5196 0.292893 11.7071C0.48043 11.8947 0.734784 12 1 12H4.65L9.38 15.78C9.55594 15.9212 9.77444 15.9987 10 16C10.1494 16.0025 10.297 15.9682 10.43 15.9C10.6002 15.819 10.744 15.6915 10.8448 15.5323C10.9457 15.373 10.9995 15.1885 11 15V1.00003C10.9995 0.811546 10.9457 0.627048 10.8448 0.467811C10.744 0.308573 10.6002 0.181081 10.43 0.100032ZM9 12.92L5.62 10.22C5.44406 10.0789 5.22556 10.0013 5 10H2V6.00003H5C5.22556 5.99872 5.44406 5.92119 5.62 5.78003L9 3.08003V12.92ZM13.14 0.0900322C13.0087 0.0716472 12.875 0.079308 12.7467 0.112577C12.6183 0.145846 12.4977 0.204072 12.3919 0.28393C12.286 0.363789 12.1969 0.463715 12.1297 0.578005C12.0625 0.692295 12.0184 0.81871 12 0.950032C11.9816 1.08135 11.9893 1.21501 12.0225 1.34337C12.0558 1.47173 12.114 1.59229 12.1939 1.69814C12.3552 1.91194 12.5948 2.0529 12.86 2.09003C14.2762 2.30828 15.5676 3.02616 16.5004 4.11382C17.4333 5.20148 17.9462 6.5871 17.9462 8.02003C17.9462 9.45296 17.4333 10.8386 16.5004 11.9262C15.5676 13.0139 14.2762 13.7318 12.86 13.95C12.5948 13.9686 12.3478 14.0918 12.1734 14.2924C11.999 14.4931 11.9114 14.7548 11.93 15.02C11.9486 15.2852 12.0717 15.5322 12.2724 15.7066C12.4731 15.881 12.7348 15.9686 13 15.95H13.14C15.0328 15.6637 16.7602 14.7081 18.0086 13.2567C19.2569 11.8053 19.9434 9.95441 19.9434 8.04003C19.9434 6.12566 19.2569 4.27475 18.0086 2.82337C16.7602 1.372 15.0328 0.416379 13.14 0.130032V0.0900322ZM12.68 9.87003C12.4148 9.91247 12.1773 10.0585 12.0198 10.2761C11.8622 10.4936 11.7976 10.7648 11.84 11.03C11.8824 11.2952 12.0285 11.5327 12.246 11.6903C12.4636 11.8478 12.7348 11.9125 13 11.87C13.1085 11.8688 13.2163 11.852 13.32 11.82C14.099 11.5438 14.7733 11.033 15.2502 10.3579C15.7271 9.68283 15.9832 8.87658 15.9832 8.05003C15.9832 7.22349 15.7271 6.41724 15.2502 5.74214C14.7733 5.06705 14.099 4.55627 13.32 4.28003C13.068 4.19516 12.7927 4.21386 12.5545 4.33201C12.3164 4.45015 12.1349 4.65808 12.05 4.91003C11.9651 5.16199 11.9838 5.43734 12.102 5.67551C12.2201 5.91368 12.428 6.09516 12.68 6.18003C13.0595 6.32396 13.3862 6.57993 13.6167 6.91394C13.8472 7.24795 13.9707 7.64419 13.9707 8.05003C13.9707 8.45588 13.8472 8.85212 13.6167 9.18612C13.3862 9.52013 13.0595 9.7761 12.68 9.92003V9.87003Z" fill="#121212"/>
</svg>
