-------------------------------------------------------------------------------
Test set: com.emerio.bootcamp.registryservice.RegistryServiceApplicationTests
-------------------------------------------------------------------------------
Tests run: 1, Failures: 0, Errors: 0, Skipped: 0, Time elapsed: 35.422 s - in com.emerio.bootcamp.registryservice.RegistryServiceApplicationTests
