{
  "type": "service_account",
  "project_id": "ktp-ocr-267207",
  "private_key_id": "66b72e5c112791c2c39de0937fe8b2b4e0e1fe30",
  "private_key": "-----BEGIN PRIVATE KEY-----\nMIIEvQIBADANBgkqhkiG9w0BAQEFAASCBKcwggSjAgEAAoIBAQDU1KKKjSbCWD4h\nc208Rz6di7m+3JNjeYg16uPetC2JsflPjT0+rqyXqNiBR+WPlgu258wSD3vmtWPT\nqf/1BWnRsYk4DIlFL29mQIiQVZDKOo7gdpO4C4+ytPyGWZFsz6N2Mu9sUsSM9yZ+\ns7+KC0BGWiJ17PU9yrBsduBQ7wfpXOmVja96e9Bv77hKNYvOUT6k082aYKUwfHGO\nTDKUAlUjJen0rvaclFVbmq4h/MccJImuUm40oVoP9iANfC4+zUui4V1YLuLaCpbz\nX7u/hlWt0hBjAMgTDmFeX5oTCsUuitWwzyOeX/upoq8rBPJLo8eRyWNRArSlCj2N\nKVpncVVnAgMBAAECggEAX6/uGC7YAz6bSHzV2ukJLNn6O+Z92ZZ1eBBQPPtzEdpT\nhcGxjHIKJPGDzbQecMz8HVLf/Cq8AQECjdJ7wpSZe+6/C9UPDm0CP8252HKv80wa\nmq6VQYTpKWaXtmukp3A/RNAntuMLfXlM9GAqOI1Qa5Dwt2Y+6HYtlcZomdquCuup\nWsGyBV4rxY1x2xREgkp+8Q0o4V1S+WtMhHJrbF42LKSnAdiUDtej7tT3lNBCmALR\n7Xw1daNYwcQZ2zelQgtf0qJSNRw/oE7BKLmhTHWjBK0CFVxU3QRGmXfjou+CyNz2\naYi3KV/+wj6e/AXkQCg8oVNLZ8xSfw6AEflXnMaOiQKBgQD/OsuxLdJE6aimu5r/\nE3dNQnm1OJfZp4joXrpasSv50wrhjqsr9hOim4Y0hInffExs+BmbImX8qnr5Hiqz\n+GzsFSxF+Vp/zgv5V+8z2ncW9rTFeskrdoIDVarHkcEMvPfZRRrbco2CS4bjcP6l\nEUIqIjXDSc352Ps0i3CGFCYWCwKBgQDVeRRVhT9SKrxvV6hyI4/4Cxg/VexPTbZY\nTJJbZv9ykGIJUuVAzqmc/9yJTta2TrEuN01u/giI9Vwwu4F3sEFFOCTeCGLTI1zc\nq9PWbWNIUmHhQ1759I8vhyR95DYdDPUb5xgPikwOf+/6lerPQZ+DGMgNcFPoyh8L\n6/9qoakjlQKBgF5RwRKiB1GWM9AiBl57OBxiE44n8t3pbsvIrf9z9/djyWKfkZw2\nXP07kjX4QOdJDQk8CmJtLNlZuwYy4r8NcFsyW+EkDBCs+XnUyD4WXuoqk5VjEdKx\nAczvrKQBtiDZ+JHfWtR8GdVrydZlXIVtwlDFwa6AqNDLIdJCMXwrGAQPAoGBALFN\n1K7HcnVrm4EbHIRYtz488NHCKvkfQcGLL9CM9sSP2W2HFXTDcas99E1zVvCq4YzS\nUBVNF4exyvWK95iSo1O7sxtbecGGUJ3UdalWx6yNCFESJPOUxcyjAZMyliOA3KBl\nS920b0Fnz8mg9RtZlQRM8/P9hSQHpMvBIy7MwPAVAoGAZ/gzZ7hLM8Lb/waXUd+a\n6WPTBlDnKxvLA8BGG1lhuUV376aL0XDtthZqXmJG4zfjigYhbyIYHll2bVl2lMNk\nEI70bDeOl/DISncuZA/x04qc8umQLsOLA0OkwXwFfezn4CYZ8aq6iwMwtaTS9MVu\nj5WG+fVupZ2vnZeh4MQP3oM=\n-----END PRIVATE KEY-----\n",
  "client_email": "test-ocr@ktp-ocr-267207.iam.gserviceaccount.com",
  "client_id": "103896042266810395951",
  "auth_uri": "https://accounts.google.com/o/oauth2/auth",
  "token_uri": "https://oauth2.googleapis.com/token",
  "auth_provider_x509_cert_url": "https://www.googleapis.com/oauth2/v1/certs",
  "client_x509_cert_url": "https://www.googleapis.com/robot/v1/metadata/x509/test-ocr%40ktp-ocr-267207.iam.gserviceaccount.com"
}
