{
	"info": {
		"_postman_id": "c27d053c-f44c-4177-9375-95fc1064235f",
		"name": "api_banco",
		"schema": "https://schema.getpostman.com/json/collection/v2.1.0/collection.json"
	},
	"item": [
		{
			"name": "guardar-cliente",
			"request": {
				"method": "POST",
				"header": [],
				"body": {
					"mode": "raw",
					"raw": "{\r\n    \"nombre\": \"John Doe\",\r\n    \"genero\": \"MASCULINO\",\r\n    \"edad\": 30,\r\n    \"identificacion\": \"123456789\",\r\n    \"direccion\": \"123 Main St\",\r\n    \"telefono\": \"555-555-5555\",\r\n    \"clave\": \"12345\",\r\n    \"estado\": \"ACTIVO\"\r\n}",
					"options": {
						"raw": {
							"language": "json"
						}
					}
				},
				"url": {
					"raw": "http://localhost:8080/clientes",
					"protocol": "http",
					"host": [
						"localhost"
					],
					"port": "8080",
					"path": [
						"clientes"
					]
				}
			},
			"response": []
		},
		{
			"name": "listar-clientes",
			"request": {
				"method": "GET",
				"header": [],
				"url": {
					"raw": "http://localhost:8080/clientes",
					"protocol": "http",
					"host": [
						"localhost"
					],
					"port": "8080",
					"path": [
						"clientes"
					]
				}
			},
			"response": []
		},
		{
			"name": "buscar-cliente",
			"request": {
				"method": "GET",
				"header": [],
				"url": {
					"raw": "http://localhost:8080/clientes/1",
					"protocol": "http",
					"host": [
						"localhost"
					],
					"port": "8080",
					"path": [
						"clientes",
						"1"
					]
				}
			},
			"response": []
		},
		{
			"name": "eliminar-cliente",
			"request": {
				"method": "DELETE",
				"header": [],
				"url": {
					"raw": "http://localhost:8080/clientes/1",
					"protocol": "http",
					"host": [
						"localhost"
					],
					"port": "8080",
					"path": [
						"clientes",
						"1"
					]
				}
			},
			"response": []
		},
		{
			"name": "guardar-cuenta",
			"request": {
				"method": "POST",
				"header": [],
				"body": {
					"mode": "raw",
					"raw": "{\r\n    \"numeroCuenta\": \"12345\",\r\n    \"idCliente\": 1,\r\n    \"tipoCuenta\": \"AHORROS\",\r\n    \"saldoInicial\": 230000.23,\r\n    \"estado\": \"ACTIVO\"\r\n}",
					"options": {
						"raw": {
							"language": "json"
						}
					}
				},
				"url": {
					"raw": "http://localhost:8081/cuentas",
					"protocol": "http",
					"host": [
						"localhost"
					],
					"port": "8081",
					"path": [
						"cuentas"
					]
				}
			},
			"response": []
		},
		{
			"name": "listar-cuentas",
			"request": {
				"method": "GET",
				"header": [],
				"url": {
					"raw": "http://localhost:8081/cuentas",
					"protocol": "http",
					"host": [
						"localhost"
					],
					"port": "8081",
					"path": [
						"cuentas"
					]
				}
			},
			"response": []
		},
		{
			"name": "buscar-cuenta",
			"request": {
				"method": "GET",
				"header": [],
				"url": {
					"raw": "http://localhost:8081/cuentas/1",
					"protocol": "http",
					"host": [
						"localhost"
					],
					"port": "8081",
					"path": [
						"cuentas",
						"1"
					]
				}
			},
			"response": []
		},
		{
			"name": "realizar-movimiento",
			"request": {
				"method": "POST",
				"header": [],
				"body": {
					"mode": "raw",
					"raw": "{\r\n    \"idCuenta\": 1,\r\n    \"tipoMovimiento\": \"RETIRO\",\r\n    \"valor\": 200000.32\r\n}",
					"options": {
						"raw": {
							"language": "json"
						}
					}
				},
				"url": {
					"raw": "http://localhost:8082/movimientos",
					"protocol": "http",
					"host": [
						"localhost"
					],
					"port": "8082",
					"path": [
						"movimientos"
					]
				}
			},
			"response": []
		},
		{
			"name": "listar-movimientos",
			"request": {
				"method": "GET",
				"header": [],
				"url": {
					"raw": "http://localhost:8082/movimientos",
					"protocol": "http",
					"host": [
						"localhost"
					],
					"port": "8082",
					"path": [
						"movimientos"
					]
				}
			},
			"response": []
		},
		{
			"name": "filtrar-movimientos-por-fecha",
			"request": {
				"method": "POST",
				"header": [],
				"body": {
					"mode": "raw",
					"raw": "{\r\n    \"idCuenta\": 1,\r\n    \"fechaInicio\": \"2023-05-04 17:53:00\",\r\n    \"fechaFin\": \"2023-05-04 17:53:50\"\r\n}",
					"options": {
						"raw": {
							"language": "json"
						}
					}
				},
				"url": {
					"raw": "http://localhost:8082/movimientos/fechas",
					"protocol": "http",
					"host": [
						"localhost"
					],
					"port": "8082",
					"path": [
						"movimientos",
						"fechas"
					]
				}
			},
			"response": []
		}
	]
}