<?xml version="1.0" encoding="UTF-8"?>
<svg width="50px" height="48px" viewBox="0 0 50 48" version="1.1" xmlns="http://www.w3.org/2000/svg" xmlns:xlink="http://www.w3.org/1999/xlink">
    <!-- Generator: Sketch 55 (78076) - https://sketchapp.com -->
    <title>cerrarSesionGrisOscuro</title>
    <desc>Created with Sketch.</desc>
    <g id="Page-1" stroke="none" stroke-width="1" fill="none" fill-rule="evenodd">
        <g id="cerrarSesionGrisOscuro" fill="#848484" fill-rule="nonzero">
            <path d="M25,47.87 C14.0488252,47.8678017 4.39660761,40.6802128 1.25615734,30.1889876 C-1.88429292,19.6977624 2.23119647,8.38893908 11.38,2.37 C11.8051461,2.08954651 12.3476174,2.05720952 12.8030702,2.28517006 C13.2585231,2.5131306 13.5577634,2.96675603 13.5880702,3.47517006 C13.618377,3.98358408 13.3751461,4.46954651 12.95,4.75 C4.90922678,10.03915 1.25428842,19.9511841 3.93647407,29.1942909 C6.61865972,38.4373976 15.0116835,44.8533268 24.6346992,45.0167585 C34.257715,45.1801902 42.8637644,39.0529635 45.8582718,29.9062664 C48.8527793,20.7595693 45.5365321,10.7291407 37.68,5.17 C37.0393497,4.71436507 36.8893651,3.82565032 37.345,3.18500003 C37.8006349,2.54434973 38.6893497,2.39436511 39.33,2.85 C48.1395004,9.08936739 51.8985016,20.3123243 48.6242165,30.5990176 C45.3499314,40.885711 35.7952305,47.8708768 25,47.87 Z" id="Path"></path>
            <path d="M25,26.9 L25,26.9 C24.6215884,26.8921562 24.2619672,26.7335651 24.0009845,26.4594394 C23.7400018,26.1853137 23.5992569,25.8183404 23.61,25.44 L24.21,1.51 C24.2311717,0.752921066 24.8427879,0.145704904 25.6,0.13 L25.6,0.13 C25.9801605,0.135202998 26.3423569,0.292637678 26.6054982,0.567056508 C26.8686396,0.841475338 27.0107454,1.20995579 27,1.59 L26.4,25.52 C26.3786296,26.28088 25.7611088,26.8895792 25,26.9 L25,26.9 Z" id="Path"></path>
        </g>
    </g>
</svg>