<?xml version="1.0" encoding="UTF-8"?>
<svg width="50px" height="50px" viewBox="0 0 50 50" version="1.1" xmlns="http://www.w3.org/2000/svg" xmlns:xlink="http://www.w3.org/1999/xlink">
    <!-- Generator: Sketch 55 (78076) - https://sketchapp.com -->
    <title>calendarioGrisOscuro</title>
    <desc>Created with Sketch.</desc>
    <g id="Page-1" stroke="none" stroke-width="1" fill="none" fill-rule="evenodd">
        <g id="calendarioGrisOscuro" transform="translate(-1.000000, 0.000000)" fill="#848484" fill-rule="nonzero">
            <path d="M27.51,49.18 L6.67,49.18 C5.15725571,49.2158719 3.69567014,48.6314122 2.62475374,47.5623845 C1.55383733,46.4933568 0.966798507,45.0328053 1,43.52 C1,37.2866667 1,31.0533333 1,24.82 L1,16.19 C1,14.55 1,12.92 1,11.28 C0.973602313,8.73982601 2.68121082,6.5083859 5.14,5.87 C5.50454325,5.765744 5.88093943,5.70861244 6.26,5.7 C7.08,5.7 7.89,5.7 8.74,5.7 L10.44,5.7 L10.44,7.26 C10.44,7.88 10.44,8.49 10.44,9.1 C10.4308959,10.4894201 11.2730076,11.7428663 12.5627746,12.2596565 C13.8525416,12.7764467 15.3271773,12.4512863 16.28,11.44 C16.881969,10.8379317 17.2200993,10.0213829 17.22,9.17 C17.22,8.56 17.22,7.94 17.22,7.32 L17.22,5.71 L34.77,5.71 L34.77,9.1 C34.7606539,9.8953401 35.0415151,10.6668195 35.56,11.27 C36.4643464,12.3616637 37.9524589,12.77535 39.2904666,12.3070474 C40.6284742,11.8387447 41.533809,10.5873517 41.56,9.17 C41.56,8.55 41.56,7.93 41.56,7.28 L41.56,5.61 L42.3,5.66 C42.82,5.66 43.3,5.66 43.89,5.66 C44.9881153,5.58601387 46.0907835,5.70101608 47.15,6 C49.463777,6.72747312 51.0278794,8.8847157 51,11.31 C51,14.1833333 51,17.0566667 51,19.93 L51,24.79 C51,30.99 51,37.1933333 51,43.4 C51.0692944,44.9566807 50.4798115,46.4705713 49.3760806,47.5704961 C48.2723498,48.670421 46.756432,49.2546711 45.2,49.18 L27.51,49.18 Z M7.78,7.07 L6.28,7.07 C6.01886854,7.08059639 5.76013631,7.12427846 5.51,7.2 C3.64606447,7.67076848 2.35546727,9.36804905 2.4,11.29 C2.4,12.92 2.4,14.55 2.4,16.19 L2.4,24.83 C2.4,31.0633333 2.4,37.2933333 2.4,43.52 C2.36335009,44.6650687 2.80283745,45.7741316 3.61388487,46.583284 C4.42493228,47.3924365 5.53502014,47.8293283 6.68,47.79 L45.2,47.79 C46.3880331,47.8604247 47.5495487,47.4198728 48.3920443,46.5792876 C49.2345399,45.7387024 49.6777275,44.5781899 49.61,43.39 C49.61,37.19 49.61,30.9866667 49.61,24.78 L49.61,19.93 C49.61,17.0566667 49.61,14.1833333 49.61,11.31 C49.6561615,9.48467626 48.4839437,7.85092323 46.74,7.31 C45.8227608,7.07688348 44.8729383,6.99914 43.93,7.08 C43.61,7.08 43.28,7.08 42.93,7.08 L42.93,7.28 C42.93,7.94 42.93,8.56 42.93,9.19 C42.9040032,11.1904447 41.6349666,12.9630758 39.7496463,13.6324203 C37.8643259,14.3017648 35.761612,13.7262049 34.48,12.19 C33.7553924,11.3254515 33.3682095,10.227841 33.39,9.1 L33.39,7.1 L18.61,7.1 L18.61,7.31 C18.61,7.94 18.61,8.56 18.61,9.18 C18.6060365,10.3813138 18.1322762,11.5334129 17.29,12.39 C15.9479172,13.8129017 13.873173,14.272269 12.0558822,13.5488814 C10.2385914,12.8254938 9.04709417,11.0659722 9.05,9.11 C9.05,8.5 9.05,7.89 9.05,7.26 L9.05,7.08 L7.78,7.08 L7.78,7.07 Z M6.78,44.37 C6.09563234,44.4024944 5.42644405,44.1614427 4.92,43.7 C4.44892865,43.2022395 4.19994255,42.534668 4.23,41.85 L4.23,18.61 L47.72,18.61 L47.78,19.39 C47.78,19.51 47.78,19.63 47.78,19.75 C47.78,27.0833333 47.78,34.45 47.78,41.85 C47.83985,42.5403253 47.5893444,43.2214735 47.096489,43.7085306 C46.6036337,44.1955876 45.9195687,44.438015 45.23,44.37 L6.74,44.37 L6.78,44.37 Z M5.57,20 L5.57,41.85 C5.54264929,42.1611011 5.63974144,42.4703576 5.84,42.71 C6.08989475,42.9130151 6.40942965,43.0099526 6.73,42.98 L45.26,42.98 C45.5778173,43.0355156 45.9028952,42.9342855 46.1330038,42.7081442 C46.3631125,42.482003 46.4699804,42.1587347 46.42,41.84 C46.42,34.56 46.42,27.2766667 46.42,19.99 L5.57,19.99 L5.57,20 Z" id="Shape"></path>
            <path d="M13.8,11.87 C12.6213017,11.8675406 11.5532648,11.1750771 11.07,10.1 C10.8785696,9.65334015 10.7701318,9.17553611 10.75,8.69 C10.75,8.13 10.75,7.57 10.75,7.01 L10.75,5.61 C10.75,5.07 10.75,4.53 10.75,3.99 C10.7284603,3.1584413 11.0431024,2.35331993 11.6227703,1.75671371 C12.2024382,1.16010749 12.9981659,0.822413107 13.83,0.82 L13.83,0.82 C14.6653604,0.822474346 15.4646041,1.16090667 16.0477236,1.75907445 C16.6308432,2.35724222 16.9488061,3.16484767 16.93,4 C16.93,5.59 16.93,7.18 16.93,8.77 C16.9518811,10.2761339 15.8744117,11.5741876 14.39,11.83 C14.1952876,11.8640477 13.9975261,11.8774553 13.8,11.87 Z M12.12,7 L12.12,7 C12.12,7.53 12.12,8.07 12.12,8.6 C12.1314334,8.91611915 12.1991607,9.22766475 12.32,9.52 C12.6364291,10.1834882 13.3556906,10.5553791 14.08,10.43 C14.9301517,10.3083718 15.5539015,9.56847542 15.53,8.71 C15.53,7.13 15.53,5.55 15.53,3.97 C15.5407181,3.50678992 15.3662477,3.05843457 15.0452569,2.7243038 C14.7242661,2.39017303 14.2832673,2.19786453 13.82,2.19 C13.3520921,2.1946707 12.906539,2.39088387 12.5871937,2.73290459 C12.2678484,3.07492532 12.1026123,3.53287098 12.13,4 C12.13,4.53 12.13,5.07 12.13,5.6 L12.13,7 L12.13,7 L12.12,7 Z" id="Shape"></path>
            <path d="M38.13,11.87 C36.9513017,11.8675406 35.8832648,11.1750771 35.4,10.1 C35.2084503,9.64987692 35.1000329,9.16877475 35.08,8.68 C35.08,8.12 35.08,7.56 35.08,6.99 L35.08,5.61 C35.08,5.07 35.08,4.53 35.08,3.99 C35.0510098,2.73626235 35.7826488,1.58934284 36.931778,1.08714706 C38.0809072,0.584951282 39.4195964,0.827089969 40.32,1.7 C40.9246684,2.31251776 41.2625729,3.13930539 41.26,4 L41.26,4.5 C41.26,5.9 41.26,7.31 41.26,8.71 C41.2818811,10.2161339 40.2044117,11.5141876 38.72,11.77 C38.5274872,11.824389 38.329683,11.8579151 38.13,11.87 Z M36.45,7 C36.45,7.53 36.45,8.07 36.45,8.6 C36.4616456,8.91609243 36.5293648,9.22760097 36.65,9.52 C36.9584617,10.1911486 37.6840461,10.5663088 38.41,10.43 C39.2561633,10.3037955 39.8745467,9.56517095 39.85,8.71 C39.85,7.31 39.85,5.92 39.85,4.52 L39.85,4 C39.8583429,3.49578903 39.6637731,3.00936459 39.31,2.65 C38.9992269,2.34096164 38.5782711,2.16826183 38.14,2.17 L38.14,2.17 C37.6701334,2.17708194 37.2238879,2.37721411 36.9060946,2.72338189 C36.5883012,3.06954967 36.4269698,3.53124232 36.46,4 C36.46,4.53 36.46,5.07 36.46,5.6 L36.46,7 L36.46,7 L36.45,7 Z" id="Shape"></path>
            <path d="M25,28.06 L17.25,28.06 L17.25,21.93 L25,21.93 L25,28.07 L25,28.06 Z M18.63,26.67 L23.63,26.67 L23.63,23.32 L18.63,23.32 L18.63,26.68 L18.63,26.67 Z" id="Shape"></path>
            <path d="M34.75,28.07 L27,28.07 L27,21.94 L34.76,21.94 L34.76,28.08 L34.75,28.07 Z M28.38,26.68 L33.38,26.68 L33.38,23.32 L28.38,23.32 L28.38,26.68 L28.38,26.68 Z" id="Shape"></path>
            <path d="M44.48,28.06 L36.7,28.06 L36.7,21.94 L44.47,21.94 L44.47,28.06 L44.48,28.06 Z M38.09,26.67 L43.09,26.67 L43.09,23.33 L38.09,23.33 L38.09,26.67 Z" id="Shape"></path>
            <path d="M15.29,34.55 L7.53,34.55 L7.53,28.42 L15.29,28.42 L15.29,34.56 L15.29,34.55 Z M8.92,33.17 L13.92,33.17 L13.92,29.81 L8.92,29.81 L8.92,33.17 Z" id="Shape"></path>
            <path d="M25,34.56 L17.26,34.56 L17.26,28.43 L25,28.43 L25,34.56 Z M18.63,33.17 L23.63,33.17 L23.63,29.82 L18.63,29.82 L18.63,33.18 L18.63,33.17 Z" id="Shape"></path>
            <path d="M34.74,34.55 L27,34.55 L27,28.42 L34.76,28.42 L34.76,34.56 L34.74,34.55 Z M28.37,33.16 L33.37,33.16 L33.37,29.8 L28.37,29.8 L28.37,33.16 L28.37,33.16 Z" id="Shape"></path>
            <path d="M44.48,34.56 L36.72,34.56 L36.72,28.42 L44.48,28.42 L44.48,34.56 Z M38.11,33.17 L43.11,33.17 L43.11,29.81 L38.11,29.81 L38.11,33.17 Z" id="Shape"></path>
            <path d="M15.29,41 L7.53,41 L7.53,34.91 L15.29,34.91 L15.29,41 Z M8.92,39.65 L13.92,39.65 L13.92,36.3 L8.92,36.3 L8.92,39.66 L8.92,39.65 Z" id="Shape"></path>
            <path d="M25,41 L17.25,41 L17.25,34.91 L25,34.91 L25,41 Z M18.63,39.61 L23.63,39.61 L23.63,36.29 L18.63,36.29 L18.63,39.65 L18.63,39.61 Z" id="Shape"></path>
            <path d="M34.74,41.05 L27,41.05 L27,34.92 L34.76,34.92 L34.76,41.06 L34.74,41.05 Z M28.37,39.66 L33.37,39.66 L33.37,36.3 L28.37,36.3 L28.37,39.66 L28.37,39.66 Z" id="Shape"></path>
            <path d="M44.48,41 L36.72,41 L36.72,34.91 L44.49,34.91 L44.49,41 L44.48,41 Z M38.1,39.66 L43.1,39.66 L43.1,36.3 L38.1,36.3 L38.1,39.66 Z" id="Shape"></path>
        </g>
    </g>
</svg>