{
    "name": "Filme",
    "fields": [
        {
            "fieldName": "titulo",
            "fieldType": "String",
            "fieldValidateRules": [
                "required"
            ]
        },
        {
            "fieldName": "categoria",
            "fieldType": "Categoria",
            "fieldValues": "COMEDIA,ACAO,AVENTURA,ANIME,FAMILIA,KIDS,CULT,DOCUMENTARIOS,DRAMAS,TERROS"
        }
    ],
    "relationships": [
        {
            "relationshipType": "many-to-one",
            "otherEntityName": "diretor",
            "otherEntityRelationshipName": "filme",
            "relationshipName": "diretor",
            "otherEntityField": "nome"
        },
        {
            "relationshipType": "many-to-many",
            "otherEntityName": "midia",
            "otherEntityRelationshipName": "filme",
            "relationshipName": "midia",
            "otherEntityField": "id",
            "ownerSide": false
        },
        {
            "relationshipType": "many-to-many",
            "otherEntityName": "ator",
            "otherEntityRelationshipName": "filme",
            "relationshipName": "ator",
            "otherEntityField": "id",
            "ownerSide": false
        }
    ],
    "changelogDate": "20190617164559",
    "entityTableName": "filme",
    "dto": "mapstruct",
    "pagination": "pager",
    "service": "serviceImpl",
    "jpaMetamodelFiltering": false,
    "fluentMethods": true,
    "clientRootFolder": "",
    "applications": "*"
}