0	10	15	20	25	30	35	40	45	50	55	60	65	70	75	80	85	90	95	100	105	110	115	120	125	130	135	140	145	150	155	160	165	170	175	180	185	190	195	200
5	-31765.76	-30599.66	-30153.6	-30275.08	-30261.17	-30461.35	-30807.15	-30914.99	-31411.55	-31527.64	-31604.23	-33241.64	-33034.09	-32965.34	-32974.72	-32988.39	-33008.1	-33017.49	-33027.79	-33036.07	-33042.61	-33064.5	-33072.52	-33073.01	-33073.62	-33072.61	-33079.16	-33079.16	-33082.27	-33082.27	-33084.96	-33084.96	-33084.96	-33084.96	-33084.96	-33084.96	-33084.96	-33084.96	-33084.96
10	-31765.76	-30599.66	-30153.6	-30275.08	-30261.17	-30461.35	-30807.15	-30914.99	-31411.55	-31527.64	-31604.23	-33241.64	-33034.09	-32965.34	-32974.72	-32988.39	-33008.1	-33017.49	-33027.79	-33036.07	-33042.61	-33064.5	-33072.52	-33073.01	-33073.62	-33072.61	-33079.16	-33079.16	-33082.27	-33082.27	-33084.96	-33084.96	-33084.96	-33084.96	-33084.96	-33084.96	-33084.96	-33084.96	-33084.96
15	-31765.76	-30599.66	-30153.6	-30275.08	-30261.17	-30461.35	-30807.15	-30914.99	-31411.55	-31527.64	-31604.23	-33241.64	-33034.09	-32965.34	-32974.72	-32988.39	-33008.1	-33017.49	-33027.79	-33036.07	-33042.61	-33064.5	-33072.52	-33073.01	-33073.62	-33072.61	-33079.16	-33079.16	-33082.27	-33082.27	-33084.96	-33084.96	-33084.96	-33084.96	-33084.96	-33084.96	-33084.96	-33084.96	-33084.96
20	-31765.76	-30599.66	-30153.6	-30275.08	-30261.17	-30461.35	-30807.15	-30914.99	-31411.55	-31527.64	-31604.23	-33241.64	-33034.09	-32965.34	-32974.72	-32988.39	-33008.1	-33017.49	-33027.79	-33036.07	-33042.61	-33064.5	-33072.52	-33073.01	-33073.62	-33072.61	-33079.16	-33079.16	-33082.27	-33082.27	-33084.96	-33084.96	-33084.96	-33084.96	-33084.96	-33084.96	-33084.96	-33084.96	-33084.96
25	-31765.76	-30599.66	-30153.6	-30275.08	-30261.17	-30461.35	-30807.15	-30914.99	-31411.55	-31527.64	-31604.23	-33241.64	-33034.09	-32965.34	-32974.72	-32988.39	-33008.1	-33017.49	-33027.79	-33036.07	-33042.61	-33064.5	-33072.52	-33073.01	-33073.62	-33072.61	-33079.16	-33079.16	-33082.27	-33082.27	-33084.96	-33084.96	-33084.96	-33084.96	-33084.96	-33084.96	-33084.96	-33084.96	-33084.96
30	-31765.76	-30599.66	-30153.6	-30275.08	-30261.17	-30461.35	-30807.15	-30914.99	-31411.55	-31527.64	-31604.23	-33241.64	-33034.09	-32965.34	-32974.72	-32988.39	-33008.1	-33017.49	-33027.79	-33036.07	-33042.61	-33064.5	-33072.52	-33073.01	-33073.62	-33072.61	-33079.16	-33079.16	-33082.27	-33082.27	-33084.96	-33084.96	-33084.96	-33084.96	-33084.96	-33084.96	-33084.96	-33084.96	-33084.96
35	-31765.76	-30599.66	-30153.6	-30275.08	-30261.17	-30461.35	-30807.15	-30914.99	-31411.55	-31527.64	-31604.23	-33241.64	-33034.09	-32965.34	-32974.72	-32988.39	-33008.1	-33017.49	-33027.79	-33036.07	-33042.61	-33064.5	-33072.52	-33073.01	-33073.62	-33072.61	-33079.16	-33079.16	-33082.27	-33082.27	-33084.96	-33084.96	-33084.96	-33084.96	-33084.96	-33084.96	-33084.96	-33084.96	-33084.96
40	-31818.11	-31002.91	-30143	-29810.47	-29800.89	-29734.58	-30137.82	-30194.67	-30262	-30615.29	-30899.15	-31193.79	-31251.31	-31847.22	-32051.9	-32863.37	-32928.79	-32916.83	-32943.68	-32977.92	-32992.65	-33004.59	-33015.76	-33036.27	-33054.08	-33066.73	-33071.09	-33072.88	-33078.12	-33078.12	-33078.12	-33078.12	-33078.12	-33078.12	-33080.07	-33080.07	-33080.07	-33080.07	-33082.76
45	-31818.11	-31002.91	-30143	-29810.47	-29800.89	-29734.58	-30137.82	-30194.67	-30262	-30615.29	-30899.15	-31193.79	-31251.31	-31847.22	-32051.9	-32863.37	-32928.79	-32916.83	-32943.68	-32977.92	-32992.65	-33004.59	-33015.76	-33036.27	-33054.08	-33066.73	-33071.09	-33072.88	-33078.12	-33078.12	-33078.12	-33078.12	-33078.12	-33078.12	-33080.07	-33080.07	-33080.07	-33080.07	-33082.76
50	-31818.11	-31002.91	-30143	-29810.47	-29800.89	-29734.58	-30137.82	-30194.67	-30262	-30615.29	-30899.15	-31193.79	-31251.31	-31847.22	-32051.9	-32863.37	-32928.79	-32916.83	-32943.68	-32977.92	-32992.65	-33004.59	-33015.76	-33036.27	-33054.08	-33066.73	-33071.09	-33072.88	-33078.12	-33078.12	-33078.12	-33078.12	-33078.12	-33078.12	-33080.07	-33080.07	-33080.07	-33080.07	-33082.76
55	-31818.11	-31002.91	-30143	-29810.47	-29800.89	-29734.58	-30137.82	-30194.67	-30262	-30615.29	-30899.15	-31193.79	-31251.31	-31847.22	-32051.9	-32863.37	-32928.79	-32916.83	-32943.68	-32977.92	-32992.65	-33004.59	-33015.76	-33036.27	-33054.08	-33066.73	-33071.09	-33072.88	-33078.12	-33078.12	-33078.12	-33078.12	-33078.12	-33078.12	-33080.07	-33080.07	-33080.07	-33080.07	-33082.76
60	-31956.36	-31416.31	-30531.45	-29978.72	-29737.62	-29713.47	-29800.55	-30029.99	-30031.41	-30360.37	-30395.66	-30773.81	-30911.6	-31005.74	-31553.36	-31873	-31924.96	-31973.48	-32807.23	-32832.66	-32851.89	-32898.34	-32941.91	-32964	-32973.48	-33011.66	-33023.08	-33040.37	-33047.69	-33055.01	-33059.33	-33066.45	-33065.59	-33073.12	-33073.12	-33076.07	-33076.07	-33078.12	-33078.12
65	-31956.36	-31416.31	-30531.45	-29978.72	-29737.62	-29713.47	-29800.55	-30029.99	-30031.41	-30360.37	-30395.66	-30773.81	-30911.6	-31005.74	-31553.36	-31873	-31924.96	-31973.48	-32807.23	-32832.66	-32851.89	-32898.34	-32941.91	-32964	-32973.48	-33011.66	-33023.08	-33040.37	-33047.69	-33055.01	-33059.33	-33066.45	-33065.59	-33073.12	-33073.12	-33076.07	-33076.07	-33078.12	-33078.12
70	-32005.58	-31706.99	-30897.86	-30226.83	-29903.29	-29677.83	-29865.07	-30068.92	-30017.83	-29991.83	-30302.51	-30305.17	-30356.14	-30454.68	-30870.52	-30950.16	-31019.96	-31367.77	-31454.22	-32213.17	-32747.75	-32763.68	-32801.78	-32855.64	-32896.9	-32928.51	-32947.83	-32993.51	-33013.67	-33022.45	-33027.76	-33034.55	-33035.64	-33037.35	-33048.83	-33057.83	-33059.56	-33063.93	-33068.47
75	-32005.58	-31706.99	-30897.86	-30226.83	-29903.29	-29677.83	-29865.07	-30068.92	-30017.83	-29991.83	-30302.51	-30305.17	-30356.14	-30454.68	-30870.52	-30950.16	-31019.96	-31367.77	-31454.22	-32213.17	-32747.75	-32763.68	-32801.78	-32855.64	-32896.9	-32928.51	-32947.83	-32993.51	-33013.67	-33022.45	-33027.76	-33034.55	-33035.64	-33037.35	-33048.83	-33057.83	-33059.56	-33063.93	-33068.47
80	-32021.71	-31896.41	-31233.13	-30529.61	-30081.33	-29791.96	-29611.81	-29844.27	-29770.17	-29994.47	-29949.32	-29956.29	-30238.77	-30276.21	-30553.76	-30646.08	-30835.23	-30911.63	-31053.72	-32110.98	-32697.12	-32691.14	-32677.28	-32737.4	-32789.22	-32822.01	-32858.75	-32872.96	-32903.71	-32927.77	-32955.38	-32969.54	-32996.67	-33004.55	-33019.17	-33027.32	-33031.18	-33034.94	-33038.11
85	-32021.71	-31896.41	-31233.13	-30529.61	-30081.33	-29791.96	-29611.81	-29844.27	-29770.17	-29994.47	-29949.32	-29956.29	-30238.77	-30276.21	-30553.76	-30646.08	-30835.23	-30911.63	-31053.72	-32110.98	-32697.12	-32691.14	-32677.28	-32737.4	-32789.22	-32822.01	-32858.75	-32872.96	-32903.71	-32927.77	-32955.38	-32969.54	-32996.67	-33004.55	-33019.17	-33027.32	-33031.18	-33034.94	-33038.11
90	-32026.16	-31988.89	-31505	-30834.54	-30286.61	-29915.85	-29709.63	-29895.19	-29811.4	-29743	-29981.62	-29960.21	-29949.17	-30225.08	-30249.11	-30480.55	-30606.22	-30607.78	-30814.81	-30927.23	-31257.07	-31699.85	-31716.63	-31745.52	-32670.08	-32705.33	-32746.12	-32783.68	-32824.49	-32843.59	-32865.77	-32879.42	-32915.27	-32924.74	-32949.31	-32976.39	-32980.56	-32995.25	-33008.97
95	-32026.16	-31988.89	-31505	-30834.54	-30286.61	-29915.85	-29709.63	-29895.19	-29811.4	-29743	-29981.62	-29960.21	-29949.17	-30225.08	-30249.11	-30480.55	-30606.22	-30607.78	-30814.81	-30927.23	-31257.07	-31699.85	-31716.63	-31745.52	-32670.08	-32705.33	-32746.12	-32783.68	-32824.49	-32843.59	-32865.77	-32879.42	-32915.27	-32924.74	-32949.31	-32976.39	-32980.56	-32995.25	-33008.97
100	-32026.16	-32009.25	-31681.24	-31093.63	-30493.64	-30085.59	-29821.94	-29833.78	-29855.43	-29793.36	-29728.76	-29978.23	-29947.58	-30211.81	-30207.53	-30227.87	-30580.19	-30584.87	-30651.11	-30657.32	-30856.8	-31146.36	-31189.55	-31635.82	-31665.21	-31737.3	-32645.52	-32676.19	-32716.6	-32766.54	-32795.71	-32821.82	-32859.41	-32885.72	-32903.35	-32937.85	-32950.79	-32955.37	-32976.57
105	-32026.16	-32009.25	-31681.24	-31093.63	-30493.64	-30085.59	-29821.94	-29833.78	-29855.43	-29793.36	-29728.76	-29978.23	-29947.58	-30211.81	-30207.53	-30227.87	-30580.19	-30584.87	-30651.11	-30657.32	-30856.8	-31146.36	-31189.55	-31635.82	-31665.21	-31737.3	-32645.52	-32676.19	-32716.6	-32766.54	-32795.71	-32821.82	-32859.41	-32885.72	-32903.35	-32937.85	-32950.79	-32955.37	-32976.57
110	-32026.16	-32025.05	-31864.45	-31288.28	-30736.78	-30232.92	-29934.96	-29738.08	-29771.38	-29848.35	-29775.43	-30014.26	-29967.33	-30224.04	-30202.91	-30210.79	-30455.11	-30451.28	-30512.81	-30622.32	-30645.62	-30712.62	-30721.12	-31561.36	-31606.12	-31642.39	-31695.76	-32652.76	-32642.47	-32684.15	-32732.31	-32753.05	-32788.09	-32829.15	-32863.65	-32883.79	-32899.6	-32913.21	-32934.87
115	-32026.16	-32025.05	-31960.03	-31477.13	-30959.32	-30372.73	-30062.2	-29815.64	-29841.15	-29899.04	-29822.33	-29753.37	-29998.94	-30250.67	-30212.33	-30198.05	-30425.34	-30430.77	-30433.38	-30439.95	-30594.44	-30636.31	-30646.64	-31128.97	-31555.71	-31575.43	-31591.84	-31654.01	-32608.62	-32621.5	-32671.66	-32712.29	-32733.74	-32760.64	-32807.7	-32835.71	-32868.76	-32892.4	-32904.32
120	-32026.16	-32025.05	-32002	-31683.63	-31103.52	-30543.36	-30160.43	-29930.08	-29904.53	-29783.42	-29857.09	-29785.08	-29732.55	-29980.78	-30237.71	-30206.41	-30433.45	-30424.31	-30415.82	-30417.92	-30413.78	-30522.09	-30576.83	-31050.8	-31107.75	-31124.85	-31156.76	-31569	-31634.92	-31649	-32598.19	-32620.78	-32669.79	-32695.17	-32735.83	-32771.92	-32807.55	-32840.32	-32867.24
125	-32026.16	-32025.05	-32002	-31683.63	-31103.52	-30543.36	-30160.43	-29930.08	-29904.53	-29783.42	-29857.09	-29785.08	-29732.55	-29980.78	-30237.71	-30206.41	-30433.45	-30424.31	-30415.82	-30417.92	-30413.78	-30522.09	-30576.83	-31050.8	-31107.75	-31124.85	-31156.76	-31569	-31634.92	-31649	-32598.19	-32620.78	-32669.79	-32695.17	-32735.83	-32771.92	-32807.55	-32840.32	-32867.24
130	-32026.16	-32026.16	-32007.92	-31838.74	-31279.64	-30705.9	-30287.1	-30014.95	-29805.27	-29838.24	-29892.41	-29814.26	-29771.45	-30006.73	-30261.92	-30219.51	-30438.54	-30427.02	-30419.18	-30407.08	-30408.52	-30403.84	-30546.84	-30550.7	-30562.03	-31054.41	-31081.29	-31128.59	-31566.97	-31586.93	-32523.67	-32572.64	-32610.52	-32638.24	-32684.32	-32730.04	-32759.72	-32790.07	-32817.98
135	-32026.16	-32026.16	-32022.04	-31933.68	-31413.8	-30853.61	-30397.09	-30105.96	-29864.33	-29885.33	-29767.48	-29845.15	-29791.51	-29744.66	-29988.2	-29950.57	-30444.07	-30431.05	-30424.92	-30411.88	-30410.11	-30407.35	-30525.31	-30537.15	-30534.83	-31018.13	-31013.8	-31023.97	-31063.13	-31137.03	-31547.42	-32505.07	-32576.17	-32618.69	-32618	-32659.3	-32692.84	-32728.02	-32758.89
140	-32026.16	-32026.16	-32022.04	-31952.69	-31565.87	-31022.89	-30524.67	-30198.51	-29948.85	-29785.88	-29820.56	-29878.67	-29814.72	-29761.79	-30016.51	-29974.64	-30460.9	-30440.48	-30427.58	-30416.42	-30410.55	-30408.69	-30403.27	-30508.95	-30506.01	-30971.9	-30981.12	-31003.23	-31024.89	-31058.15	-31506.26	-31533.94	-31562.25	-32516.28	-32610.62	-32637.24	-32611.37	-32654.97	-32706.68
145	-32026.16	-32026.16	-32026.16	-31981.2	-31781.1	-31190.71	-30679.69	-30297.64	-30033.27	-29829.68	-29871.58	-29897.69	-29842.08	-29784.36	-29747.54	-30000.36	-30257.9	-30451.14	-30438.94	-30427.61	-30413.01	-30410.95	-30403.9	-30508.82	-30504.65	-30967.33	-30967.61	-30973.05	-30985.84	-31006.04	-31044.84	-31084.69	-31127.32	-32487.04	-32534.67	-32576.25	-32636.4	-32666.32	-32640.11
150	-32026.16	-32026.16	-32026.16	-32004.03	-31887.89	-31370.16	-30833.68	-30405.32	-30098.76	-29892.39	-29747.26	-29781.27	-29865.21	-29815.9	-29760.09	-30009.54	-29977.54	-30460.32	-30438.48	-30430.3	-30417.84	-30411.57	-30401.57	-30510.56	-30502.21	-30504.26	-30965.16	-30965.08	-30971.58	-30964.65	-30973.3	-31017.32	-31056.55	-31498.89	-32493.9	-32534.92	-32582.03	-32620.01	-32654.7
155	-32026.16	-32026.16	-32026.16	-32025.21	-31933.64	-31533.22	-30987.61	-30486.12	-30196.38	-29954.62	-29795.33	-29820.1	-29892.01	-29834.85	-29774.39	-30023.55	-29995.02	-30246.59	-30447.33	-30435.12	-30424.09	-30416.46	-30405.87	-30511.33	-30504.72	-30499.73	-30962.57	-30960.05	-30962.39	-30965.93	-30975.08	-30984.74	-31033.43	-31460.84	-32420.81	-32472.33	-32495.11	-32532.49	-32592
160	-32026.16	-32026.16	-32026.16	-32026.16	-31947.13	-31711.97	-31110.75	-30594.57	-30281.97	-29997.52	-29838.32	-29863.18	-29763.68	-29855.26	-29797.05	-30042.35	-30009.01	-30260.01	-30456.18	-30439.26	-30428.14	-30416.92	-30410.87	-30514.95	-30511.01	-30505.65	-30962.21	-30959.71	-30959.98	-30961.5	-30961.48	-30955.04	-30989.88	-31446.85	-32408.64	-32418.67	-32461.67	-32474.22	-32520.68
165	-32026.16	-32026.16	-32026.16	-32026.16	-31965.66	-31778.78	-31267.4	-30726.95	-30375.71	-30068.64	-29888.12	-29741.99	-29800.34	-29879.53	-29824.05	-29765.72	-30023.83	-30281.81	-30467.85	-30445.89	-30430.24	-30419.55	-30412.15	-30517.9	-30507.96	-30506.69	-30965.69	-30961.11	-30963.22	-30960.14	-30962.49	-30955.08	-30982.32	-31433.28	-31444.34	-31448.36	-32438.7	-32449.19	-32454.04
170	-32026.16	-32026.16	-32026.16	-32026.16	-32004.9	-31854.82	-31381.78	-30816.37	-30435.89	-30179.74	-29943.79	-29787.93	-29844.06	-29740.24	-29851.86	-29785.35	-30038.03	-30002.15	-30486.43	-30456.6	-30437.69	-30422.6	-30414.45	-30522.78	-30516.93	-30504.1	-30972.39	-30962.9	-30960.53	-30959.21	-30963.22	-30957.88	-30977.22	-30968.42	-31436.92	-31441.5	-32424.48	-32438.64	-32438.79
175	-32026.16	-32026.16	-32026.16	-32026.16	-32014.9	-31877.97	-31521.92	-30975.04	-30529.73	-30255.89	-29988.83	-29828.26	-29880.3	-29765.87	-29869.93	-29806.79	-30053.46	-30014.4	-30495.26	-30464.36	-30443.25	-30428.26	-30419.17	-30523.39	-30518.41	-30504.75	-30504.34	-30970.26	-30963.47	-30958.3	-30961.67	-30961.98	-30969.6	-30970.35	-30958.53	-31431.13	-32414.31	-32429.32	-32438.76
180	-32026.16	-32026.16	-32026.16	-32026.16	-32022.29	-31913.89	-31655.61	-31103.02	-30621.86	-30327.79	-30041.26	-29875.75	-29902.7	-29802.35	-29890.07	-29826.31	-30060.73	-30028.39	-29995.02	-30474.41	-30453.9	-30438.08	-30421.48	-30528.13	-30520.54	-30510.1	-30506.37	-30969.99	-30964.72	-30959.21	-30963.51	-30960.92	-30956.85	-30958.36	-30950.23	-30947.03	-31422.17	-32421.35	-32431.37
185	-32026.16	-32026.16	-32026.16	-32026.16	-32025.21	-31937.11	-31743.12	-31246.31	-30723.83	-30392.53	-30126.31	-29922.15	-29934.83	-29825.91	-29910.88	-29844.91	-30073.2	-30040.15	-30007.29	-30481.82	-30461.73	-30443.13	-30429.3	-30530.16	-30523.63	-30517.9	-30509.37	-30972.93	-30966.88	-30959.54	-30962.92	-30962.06	-30955.56	-30958.3	-30953.71	-30950.01	-30947.5	-31418.59	-31415.85
190	-32026.16	-32026.16	-32026.16	-32026.16	-32026.16	-31960.82	-31813.46	-31391.17	-30830.78	-30485.02	-30186.16	-29972.46	-29991.43	-29855.59	-29920.89	-29865.31	-30093.43	-30051.39	-30020.61	-30280.91	-30470.1	-30444.72	-30432.56	-30532.83	-30528.71	-30518.55	-30511.74	-30975.69	-30970.37	-30961.5	-30962.46	-30961.32	-30958.88	-30957.33	-30955.27	-30952.97	-30948.4	-31420.7	-31417.65
195	-32026.16	-32026.16	-32026.16	-32026.16	-32026.16	-32014.87	-31892.43	-31639.02	-31063.26	-30629.41	-30325.4	-30075.01	-30057.61	-29918.64	-29973.59	-29902.73	-29843.57	-30077.45	-30044.15	-30302.09	-30269.4	-30462.89	-30442.69	-30534.95	-30533.79	-30522.98	-30516.81	-30508.29	-30973.64	-30967.7	-30962.57	-30963.59	-30959.01	-30967.44	-30959.36	-30957.93	-30949.89	-30948.37	-30941.42
200	-32026.16	-32026.16	-32026.16	-32026.16	-32026.16	-32026.16	-31903.74	-31722.09	-31203.65	-30713.56	-30385.41	-30132.54	-30087.29	-29942.78	-30002.93	-29927.64	-29857.49	-30092.04	-30057.69	-30317.08	-30275.44	-30467.24	-30448.29	-30540.84	-30533.29	-30526.91	-30515.79	-30515.48	-30976.68	-30967.7	-30965.45	-30961.96	-30958.28	-30964.62	-30963.22	-30958.15	-30953.72	-30951.23	-30943.96
205	-32026.16	-32026.16	-32026.16	-32026.16	-32026.16	-32026.16	-31961.6	-31775.51	-31331.96	-30822.61	-30476.23	-30194.63	-29976.42	-29986.12	-29869.1	-29959.11	-29883.4	-30108.92	-30066.79	-30327.49	-30292.57	-30477.41	-30458.84	-30549.18	-30534.63	-30526.57	-30516.36	-30513.54	-30976.52	-30972.34	-30968	-30962.8	-30959.69	-30962.39	-30967.54	-30956.88	-30956.08	-30953.73	-30946
210	-32026.16	-32026.16	-32026.16	-32026.16	-32026.16	-32026.16	-31999.81	-31830.31	-31410.03	-30929.53	-30526.52	-30253.37	-30031.58	-30023.96	-29893.83	-29981.89	-29908.74	-30123.72	-30073.59	-30041.92	-30306.54	-30490.16	-30465.31	-30554.05	-30535.58	-30529.52	-30522.15	-30515.84	-30980.2	-30975.74	-30969.05	-30960.58	-30961.48	-30961.2	-30963.29	-30961.36	-30959.03	-30954.37	-30946.85
215	-32026.16	-32026.16	-32026.16	-32026.16	-32026.16	-32026.16	-32018.74	-31862.6	-31650.49	-31168.87	-30728.89	-30382.61	-30131.29	-30095.68	-29970.95	-30029.6	-29951.49	-30173.09	-30112.28	-30065.55	-30318.94	-30502.04	-30473.11	-30563.39	-30545.37	-30534.46	-30528.04	-30515.61	-30514.91	-30977.9	-30972.87	-30960.53	-30959.69	-30962.12	-30964.82	-30965.41	-30954.5	-30955.82	-30947.83
220	-32026.16	-32026.16	-32026.16	-32026.16	-32026.16	-32026.16	-32018.74	-31896.54	-31723.24	-31286.29	-30790.74	-30446.91	-30178.76	-30144.82	-29990.35	-30048.22	-29971.53	-29901.75	-30119.41	-30074.46	-30328.03	-30511.97	-30483.28	-30566.16	-30551.23	-30538.95	-30528.59	-30520.74	-30512.86	-30981.33	-30973.32	-30965.06	-30961.19	-30961.41	-30964.78	-30963.38	-30953.15	-30954.47	-30946.45
225	-32026.16	-32026.16	-32026.16	-32026.16	-32026.16	-32026.16	-32026.16	-31966.59	-31778.93	-31503.51	-31020.86	-30607.9	-30296.47	-30231.68	-30054.15	-30093.02	-30014.89	-29935.99	-30149.04	-30096.33	-30063.61	-30531.94	-30502.51	-30579.16	-30557.67	-30542.06	-30530.42	-30529.1	-30517.38	-30990.5	-30975.33	-30969.09	-30961.13	-30957.67	-30961.29	-30957.1	-30957.53	-30952.43	-30951.03
230	-32026.16	-32026.16	-32026.16	-32026.16	-32026.16	-32026.16	-32026.16	-31989.13	-31830.6	-31596.33	-31120.54	-30708.21	-30353.55	-30282.93	-30081.46	-30128.69	-30034.73	-29954.34	-30168.86	-30113.52	-30072.91	-30536.91	-30513.07	-30584.62	-30564.47	-30547.75	-30533.79	-30528.47	-30521.76	-30514.92	-30978.95	-30969.32	-30960.06	-30958.68	-30957.49	-30958.93	-30957.14	-30951.64	-30950.97
235	-32026.16	-32026.16	-32026.16	-32026.16	-32026.16	-32026.16	-32026.16	-32005.38	-31877.24	-31652.85	-31242.11	-30768.92	-30453.32	-30327.85	-30109.22	-30160.56	-30052.01	-29974.61	-29900.2	-30131.38	-30078.85	-30550.37	-30525.26	-30598.32	-30568.43	-30552.33	-30538.6	-30528.38	-30525.86	-30517.7	-30507.27	-30975	-30963.99	-30959.4	-30959.64	-30960.92	-30955.86	-30952.91	-30951.45
240	-32026.16	-32026.16	-32026.16	-32026.16	-32026.16	-32026.16	-32026.16	-32019.09	-31931.54	-31765.94	-31442.31	-30966.99	-30594.83	-30434.75	-30221.85	-30043.23	-30101.13	-30018.95	-29937.22	-29862.81	-30099.13	-30566.29	-30536.03	-30609.7	-30577.33	-30559.69	-30544.21	-30531.43	-30526.59	-30519.54	-30517.84	-30978.12	-30968.2	-30960.05	-30960.74	-30959.22	-30957.24	-30950.91	-30953.39
245	-32026.16	-32026.16	-32026.16	-32026.16	-32026.16	-32026.16	-32026.16	-32019.09	-31965.96	-31784.77	-31493.8	-31056.68	-30674.27	-30341.74	-30261.15	-30068.27	-30122.92	-30033.67	-29944.56	-29870.82	-30114.11	-30577.82	-30544.74	-30615.24	-30580.12	-30564.33	-30548.58	-30536.71	-30525.95	-30521.15	-30518.45	-30982.99	-30973.25	-30959.95	-30956.53	-30958.49	-30957.55	-30957.45	-30953.39
250	-32026.16	-32026.16	-32026.16	-32026.16	-32026.16	-32026.16	-32026.16	-32026.16	-31994.33	-31846.32	-31639.27	-31252.71	-30835.9	-30496.75	-30363.46	-30166.11	-30026.12	-30074.92	-29982.56	-29909.72	-30142.18	-30393.34	-30572.34	-30642.24	-30603.32	-30574.19	-30557.02	-30542.87	-30533.61	-30525.03	-30518.64	-30513.49	-30499.99	-30966.95	-30958.7	-30956.17	-30958.51	-30956.46	-30953.77
255	-32026.16	-32026.16	-32026.16	-32026.16	-32026.16	-32026.16	-32026.16	-32026.16	-32005.04	-31907.81	-31754.91	-31413.9	-30991.9	-30661.29	-30490.74	-30277.57	-30097.71	-30130.4	-30028.34	-29943.04	-30161.95	-30115.58	-30079.27	-30657.07	-30621.5	-30582.1	-30567.18	-30554.91	-30537.71	-30527.5	-30519.38	-30517.14	-30507.64	-30970.99	-30959.2	-30958.11	-30954.87	-30954.1	-30953.96
260	-32026.16	-32026.16	-32026.16	-32026.16	-32026.16	-32026.16	-32026.16	-32026.16	-32009.64	-31914.08	-31792.51	-31501.68	-31083.93	-30741.67	-30563.05	-30313.76	-30149.74	-30156.76	-30047.83	-29965.54	-29891.7	-30127.66	-30084.34	-30662.83	-30630.19	-30588.49	-30571.49	-30556.32	-30537.18	-30531.15	-30519.8	-30518.56	-30509.45	-30972.53	-30964.96	-30958.7	-30955.1	-30956.51	-30952.04
265	-32026.16	-32026.16	-32026.16	-32026.16	-32026.16	-32026.16	-32026.16	-32026.16	-32026.16	-31960.66	-31856.25	-31611.26	-31247.54	-30883.6	-30571.11	-30421.96	-30221.45	-30211.06	-30086.27	-30001.58	-29919.71	-30143.3	-30105.52	-30572.81	-30650.26	-30604.31	-30577.5	-30559.82	-30543.67	-30532.27	-30526.49	-30522.07	-30510.67	-30978.41	-30968.21	-30959.73	-30957.76	-30955.31	-30958.76
270	-32026.16	-32026.16	-32026.16	-32026.16	-32026.16	-32026.16	-32026.16	-32026.16	-32026.16	-31988.85	-31885.3	-31740.64	-31403.71	-31021.77	-30727.48	-30534.12	-30293.14	-30294.98	-30157.18	-30042.09	-29951.73	-30174.92	-30118.36	-30589.02	-30661.67	-30625.19	-30588.13	-30564.38	-30553.14	-30538.41	-30527.17	-30523.43	-30515.47	-30983.57	-30973.56	-30964.96	-30961.32	-30956.13	-30956.63
275	-32026.16	-32026.16	-32026.16	-32026.16	-32026.16	-32026.16	-32026.16	-32026.16	-32026.16	-31994.75	-31902.2	-31797.5	-31478.51	-31109.48	-30800.82	-30598.92	-30358.73	-30327.11	-30184.6	-30062.39	-29974.56	-30187.98	-30134.95	-30600.49	-30669.63	-30635.04	-30596.24	-30570.81	-30556.8	-30543.31	-30526.76	-30526.97	-30515.47	-30988.08	-30975.52	-30966.39	-30961.32	-30958.1	-30955.17
280	-32026.16	-32026.16	-32026.16	-32026.16	-32026.16	-32026.16	-32026.16	-32026.16	-32026.16	-32019.19	-31943.22	-31848.96	-31587.19	-31353.53	-30922.17	-30590.83	-30465.62	-30406.98	-30239.71	-30119.74	-30016.34	-29940.7	-30163.3	-30609.16	-30677.42	-30646.62	-30618	-30583.4	-30561.43	-30546.86	-30533.54	-30526.7	-30520.51	-30990.61	-30979.85	-30967.82	-30963.18	-30958.28	-30955.75
285	-32026.16	-32026.16	-32026.16	-32026.16	-32026.16	-32026.16	-32026.16	-32026.16	-32026.16	-32026.16	-31960	-31861.07	-31704.35	-31473.65	-31088.92	-30749.56	-30581.1	-30348.09	-30325.92	-30180.98	-30065.71	-29982.37	-30197.02	-30634.03	-30589.56	-30665.19	-30635.44	-30597.55	-30567.96	-30552.15	-30537.77	-30530.46	-30523.58	-30989.78	-30984.94	-30974.18	-30966.18	-30958.36	-30956.05
290	-32026.16	-32026.16	-32026.16	-32026.16	-32026.16	-32026.16	-32026.16	-32026.16	-32026.16	-32026.16	-32005.2	-31890.51	-31803.47	-31545.18	-31315.29	-30920.73	-30731.69	-30449.34	-30395.82	-30259.26	-30101.6	-30024.25	-29933.57	-30657.25	-30607.17	-30678.22	-30656.75	-30612.11	-30585.99	-30559.66	-30544.98	-30531.25	-30527.83	-30993.08	-30987.89	-30978.53	-30966.37	-30964.45	-30954.54
295	-32026.16	-32026.16	-32026.16	-32026.16	-32026.16	-32026.16	-32026.16	-32026.16	-32026.16	-32026.16	-32025.42	-31937.73	-31865.65	-31626.28	-31421.6	-31081.35	-30739.45	-30554.6	-30496.64	-30316.37	-30171.85	-30055.13	-29973.82	-30485.31	-30631.69	-30596.27	-30669.75	-30633.86	-30597.13	-30566.96	-30551.85	-30535.3	-30531.14	-30998.17	-30991.54	-30980.69	-30972.48	-30965.27	-30959.36
300	-32026.16	-32026.16	-32026.16	-32026.16	-32026.16	-32026.16	-32026.16	-32026.16	-32026.16	-32026.16	-32026.16	-31955.12	-31877.99	-31685.26	-31461.2	-31140.24	-30846.59	-30629.62	-30538.13	-30357.29	-30199.47	-30084.55	-30001.18	-30498.4	-30640.77	-30601.37	-30672.17	-30643.69	-30608.17	-30577.15	-30556.47	-30541.01	-30530.96	-30521.37	-30991.93	-30987.35	-30972.12	-30964.12	-30960.61
305	-32026.16	-32026.16	-32026.16	-32026.16	-32026.16	-32026.16	-32026.16	-32026.16	-32026.16	-32026.16	-32026.16	-31982.98	-31884.97	-31802.17	-31538.65	-31298.06	-30975.81	-30798.58	-30490.54	-30435.94	-30264.65	-30132.47	-30051.16	-30244.21	-30466.34	-30620.15	-30680.59	-30657.1	-30623	-30588.49	-30569.12	-30550.66	-30531.45	-30526.11	-30996.57	-30986.85	-30975.46	-30970.44	-30964.71
310	-32026.16	-32026.16	-32026.16	-32026.16	-32026.16	-32026.16	-32026.16	-32026.16	-32026.16	-32026.16	-32026.16	-32009.96	-31943.29	-31848.26	-31654.07	-31418.52	-31119.11	-30942.87	-30622.66	-30524.77	-30361.94	-30185.99	-30088.87	-30278.64	-30505.91	-30642.35	-30691.51	-30666.66	-30639.09	-30603.69	-30572.9	-30556.97	-30535.31	-30528.64	-30996.24	-30988.7	-30982.43	-30972.39	-30965.39
315	-32026.16	-32026.16	-32026.16	-32026.16	-32026.16	-32026.16	-32026.16	-32026.16	-32026.16	-32026.16	-32026.16	-32026.16	-31977.74	-31891.04	-31742.38	-31516.2	-31260.2	-31065.2	-30748.81	-30646.85	-30457.3	-30263.21	-30152.37	-30323.08	-30535.02	-30660.51	-30711.69	-30679.31	-30657.26	-30622.65	-30591.16	-30561.84	-30547.91	-30533.28	-30521.89	-30995.74	-30986.52	-30979.43	-30967.95
320	-32026.16	-32026.16	-32026.16	-32026.16	-32026.16	-32026.16	-32026.16	-32026.16	-32026.16	-32026.16	-32026.16	-32026.16	-32005.38	-31926.05	-31831.57	-31599.88	-31384.63	-31181.34	-30912.98	-30637.73	-30523.45	-30348.68	-30208.79	-30383.79	-30570.23	-30691.99	-30637.14	-30692.4	-30674.04	-30641.16	-30606.12	-30570.48	-30554.16	-30534.68	-30525.14	-30996.67	-30990.59	-30980.23	-30972.51
325	-32026.16	-32026.16	-32026.16	-32026.16	-32026.16	-32026.16	-32026.16	-32026.16	-32026.16	-32026.16	-32026.16	-32026.16	-32009.97	-31960.26	-31874.31	-31703.35	-31488.78	-31245.02	-31032.59	-30744.49	-30635.37	-30416.13	-30266.38	-30438.59	-30616.91	-30713.34	-30671.47	-30710.14	-30680.97	-30654.25	-30622.46	-30591.57	-30561.35	-30540.55	-30530.92	-30999.55	-30992.46	-30981.14	-30976.27
330	-32026.16	-32026.16	-32026.16	-32026.16	-32026.16	-32026.16	-32026.16	-32026.16	-32026.16	-32026.16	-32026.16	-32026.16	-32025.34	-31984.16	-31914.32	-31806.24	-31588.72	-31378	-31196.04	-30885.33	-30631.14	-30517.99	-30337.45	-30498.89	-30395.69	-30741.75	-30694.03	-30639.1	-30692.3	-30666.78	-30635.61	-30604.65	-30568.84	-30550.92	-30535.87	-30524.24	-30518.6	-30984.33	-30977.47
335	-32026.16	-32026.16	-32026.16	-32026.16	-32026.16	-32026.16	-32026.16	-32026.16	-32026.16	-32026.16	-32026.16	-32026.16	-32026.16	-32004.64	-31977.47	-31862.72	-31679.33	-31484.98	-31224.41	-31040.55	-30766	-30635.04	-30442.28	-30559.05	-30449.29	-30625.16	-30717.75	-30663.95	-30710.65	-30679.39	-30649.86	-30619.86	-30584.39	-30567.64	-30538.73	-30527.09	-30520.74	-30989.55	-30980.8
340	-32026.16	-32026.16	-32026.16	-32026.16	-32026.16	-32026.16	-32026.16	-32026.16	-32026.16	-32026.16	-32026.16	-32026.16	-32026.16	-32026.16	-32009.96	-31932.01	-31802.45	-31630.96	-31398.55	-31241.96	-30992.06	-30827.32	-30578.18	-30402.13	-30543.2	-30704.73	-30594.03	-30712.73	-30747.18	-30705.38	-30672.61	-30644.79	-30616.18	-30578.63	-30551.09	-30535.15	-30527.74	-30997.15	-30987.22
345	-32026.16	-32026.16	-32026.16	-32026.16	-32026.16	-32026.16	-32026.16	-32026.16	-32026.16	-32026.16	-32026.16	-32026.16	-32026.16	-32026.16	-32014.67	-31989.1	-31855.78	-31752.67	-31533.3	-31309.06	-31117	-30841.6	-30698.98	-30488.52	-30606.47	-30463.76	-30644.46	-30741.5	-30685.25	-30727.72	-30696.74	-30655.27	-30631.61	-30595.42	-30562.03	-30542.6	-30530	-31002.41	-30991.66
350	-32026.16	-32026.16	-32026.16	-32026.16	-32026.16	-32026.16	-32026.16	-32026.16	-32026.16	-32026.16	-32026.16	-32026.16	-32026.16	-32026.16	-32014.67	-32009.64	-31925.46	-31825.08	-31624.15	-31406.78	-31244.76	-30964.28	-30835.53	-30582.35	-30695.78	-30537.4	-30710.13	-30789.2	-30717.53	-30751.98	-30707.54	-30676.82	-30647.95	-30617.47	-30589.17	-30548.49	-30539.98	-31011.87	-30994.79
355	-32026.16	-32026.16	-32026.16	-32026.16	-32026.16	-32026.16	-32026.16	-32026.16	-32026.16	-32026.16	-32026.16	-32026.16	-32026.16	-32026.16	-32026.16	-32019.09	-31988.62	-31884.76	-31726.09	-31546.84	-31292.16	-31120	-30834.1	-30708.64	-30752.55	-30607.28	-30784.55	-30667.51	-30754.49	-30786.08	-30730.23	-30696.36	-30655.82	-30629.17	-30601.77	-30566.91	-30549.98	-31015.22	-31001.83
360	-32026.16	-32026.16	-32026.16	-32026.16	-32026.16	-32026.16	-32026.16	-32026.16	-32026.16	-32026.16	-32026.16	-32026.16	-32026.16	-32026.16	-32026.16	-32019.09	-32009.61	-31920.12	-31848.74	-31677.59	-31423.64	-31163.95	-30984.61	-30822.57	-30597.2	-30692.78	-30845.45	-30729.66	-30810.14	-30732.64	-30757.2	-30711.35	-30669.84	-30641.86	-30614.7	-30584.58	-30552.88	-31025.24	-31011.29
365	-32026.16	-32026.16	-32026.16	-32026.16	-32026.16	-32026.16	-32026.16	-32026.16	-32026.16	-32026.16	-32026.16	-32026.16	-32026.16	-32026.16	-32026.16	-32026.16	-32025.37	-32004.9	-31891.23	-31826.32	-31643.34	-31416.77	-31249.29	-30973.48	-30788.71	-30824.71	-30938.84	-30828.37	-30882.48	-30787.6	-30710.68	-30754.01	-30700.03	-30669.29	-30642.92	-30612.19	-30574.6	-31028.65	-31020.58
370	-32026.16	-32026.16	-32026.16	-32026.16	-32026.16	-32026.16	-32026.16	-32026.16	-32026.16	-32026.16	-32026.16	-32026.16	-32026.16	-32026.16	-32026.16	-32026.16	-32026.16	-32026.16	-31978.82	-31869.54	-31757.64	-31570.25	-31397.17	-31156.74	-30958.85	-30705.72	-30755.08	-30887.64	-30929.42	-30839.23	-30753.64	-30787.26	-30726.61	-30693.25	-30661.7	-30628.36	-30588.01	-31039.09	-31027.27
375	-32026.16	-32026.16	-32026.16	-32026.16	-32026.16	-32026.16	-32026.16	-32026.16	-32026.16	-32026.16	-32026.16	-32026.16	-32026.16	-32026.16	-32026.16	-32026.16	-32026.16	-32026.16	-32026.16	-31988.16	-31848.21	-31703.17	-31526.13	-31328.14	-31111.96	-30887.1	-30608.16	-30981.77	-30984.39	-30886.9	-30785.43	-30718.45	-30758.58	-30712.04	-30672.98	-30643.18	-30604.79	-30580.69	-31033.63
380	-32026.16	-32026.16	-32026.16	-32026.16	-32026.16	-32026.16	-32026.16	-32026.16	-32026.16	-32026.16	-32026.16	-32026.16	-32026.16	-32026.16	-32026.16	-32026.16	-32026.16	-32026.16	-32026.16	-32026.16	-31998.01	-31859.82	-31738.57	-31548.46	-31317.84	-31069.3	-30878.82	-30615.63	-30972.77	-30833.33	-30872.78	-30783.6	-30714.76	-30748.08	-30705.01	-30670.42	-30633.22	-30595.21	-31048.36
385	-32026.16	-32026.16	-32026.16	-32026.16	-32026.16	-32026.16	-32026.16	-32026.16	-32026.16	-32026.16	-32026.16	-32026.16	-32026.16	-32026.16	-32026.16	-32026.16	-32026.16	-32026.16	-32026.16	-32026.16	-32026.16	-32014.26	-31873.38	-31729.91	-31497.56	-31272.45	-31044.97	-30818.55	-31114.45	-30941.54	-30946.64	-30832.71	-30754.13	-30781.86	-30723.46	-30686.86	-30654.02	-30617.9	-31056.57
390	-32026.16	-32026.16	-32026.16	-32026.16	-32026.16	-32026.16	-32026.16	-32026.16	-32026.16	-32026.16	-32026.16	-32026.16	-32026.16	-32026.16	-32026.16	-32026.16	-32026.16	-32026.16	-32026.16	-32026.16	-32026.16	-32026.16	-32025.37	-31945.13	-31765.26	-31548.9	-31339.94	-31143.12	-31085.18	-31136.41	-30960.53	-30944.29	-30849.64	-30866.02	-30785.97	-30719.29	-30679.66	-30650.16	-30610.78
395	-32026.16	-32026.16	-32026.16	-32026.16	-32026.16	-32026.16	-32026.16	-32026.16	-32026.16	-32026.16	-32026.16	-32026.16	-32026.16	-32026.16	-32026.16	-32026.16	-32026.16	-32026.16	-32026.16	-32026.16	-32026.16	-32026.16	-32026.16	-32026.16	-31954.14	-31774.13	-31575.23	-31339.59	-31070.13	-31031.3	-31091.84	-31059.41	-30918.33	-30923.92	-30831.54	-30756.27	-30722.14	-30669.53	-30619.59
400	-32026.16	-32026.16	-32026.16	-32026.16	-32026.16	-32026.16	-32026.16	-32026.16	-32026.16	-32026.16	-32026.16	-32026.16	-32026.16	-32026.16	-32026.16	-32026.16	-32026.16	-32026.16	-32026.16	-32026.16	-32026.16	-32026.16	-32026.16	-32026.16	-32026.16	-31999.31	-31892.32	-31689.74	-31439.71	-31170.39	-31102.77	-31163	-30952.32	-30952.4	-30941.3	-30862.56	-30764.19	-30725.14	-30664.48
405	-32026.16	-32026.16	-32026.16	-32026.16	-32026.16	-32026.16	-32026.16	-32026.16	-32026.16	-32026.16	-32026.16	-32026.16	-32026.16	-32026.16	-32026.16	-32026.16	-32026.16	-32026.16	-32026.16	-32026.16	-32026.16	-32026.16	-32026.16	-32026.16	-32026.16	-32026.16	-31994.82	-31912.38	-31703.45	-31423.81	-31278.65	-31083.49	-31104.23	-31082.61	-31024.57	-30932.07	-30839.21	-30763.82	-30707.66
410	-32026.16	-32026.16	-32026.16	-32026.16	-32026.16	-32026.16	-32026.16	-32026.16	-32026.16	-32026.16	-32026.16	-32026.16	-32026.16	-32026.16	-32026.16	-32026.16	-32026.16	-32026.16	-32026.16	-32026.16	-32026.16	-32026.16	-32026.16	-32026.16	-32026.16	-32026.16	-32026.16	-32025.11	-31997.3	-31872.82	-31684.87	-31359.97	-31410.18	-31192.26	-31177.53	-30986.95	-30981.4	-30862.68	-30784.57
415	-32026.16	-32026.16	-32026.16	-32026.16	-32026.16	-32026.16	-32026.16	-32026.16	-32026.16	-32026.16	-32026.16	-32026.16	-32026.16	-32026.16	-32026.16	-32026.16	-32026.16	-32026.16	-32026.16	-32026.16	-32026.16	-32026.16	-32026.16	-32026.16	-32026.16	-32026.16	-32026.16	-32026.16	-32026.16	-32012.44	-31884.34	-31689.84	-31467.5	-31416.96	-31225.76	-31192.17	-31016.79	-30976.14	-30865.94
420	-32026.16	-32026.16	-32026.16	-32026.16	-32026.16	-32026.16	-32026.16	-32026.16	-32026.16	-32026.16	-32026.16	-32026.16	-32026.16	-32026.16	-32026.16	-32026.16	-32026.16	-32026.16	-32026.16	-32026.16	-32026.16	-32026.16	-32026.16	-32026.16	-32026.16	-32026.16	-32026.16	-32026.16	-32026.16	-32026.16	-32014.86	-31950.64	-31824.22	-31629.37	-31368.32	-31354.75	-31301.18	-31153.36	-31063.16
425	-32026.16	-32026.16	-32026.16	-32026.16	-32026.16	-32026.16	-32026.16	-32026.16	-32026.16	-32026.16	-32026.16	-32026.16	-32026.16	-32026.16	-32026.16	-32026.16	-32026.16	-32026.16	-32026.16	-32026.16	-32026.16	-32026.16	-32026.16	-32026.16	-32026.16	-32026.16	-32026.16	-32026.16	-32026.16	-32026.16	-32026.16	-31993.33	-31963.84	-31914.8	-31788.73	-31614.92	-31419.59	-31373.82	-31336.45
430	-32026.16	-32026.16	-32026.16	-32026.16	-32026.16	-32026.16	-32026.16	-32026.16	-32026.16	-32026.16	-32026.16	-32026.16	-32026.16	-32026.16	-32026.16	-32026.16	-32026.16	-32026.16	-32026.16	-32026.16	-32026.16	-32026.16	-32026.16	-32026.16	-32026.16	-32026.16	-32026.16	-32026.16	-32026.16	-32026.16	-32026.16	-32002.7	-31984.4	-31946.6	-31876.6	-31797.32	-31661.85	-31497.59	-31506.61
435	-32026.16	-32026.16	-32026.16	-32026.16	-32026.16	-32026.16	-32026.16	-32026.16	-32026.16	-32026.16	-32026.16	-32026.16	-32026.16	-32026.16	-32026.16	-32026.16	-32026.16	-32026.16	-32026.16	-32026.16	-32026.16	-32026.16	-32026.16	-32026.16	-32026.16	-32026.16	-32026.16	-32026.16	-32026.16	-32026.16	-32026.16	-32019.34	-31998.08	-31963.94	-31937.2	-31871.12	-31803.94	-31700.25	-31610.29
440	-32026.16	-32026.16	-32026.16	-32026.16	-32026.16	-32026.16	-32026.16	-32026.16	-32026.16	-32026.16	-32026.16	-32026.16	-32026.16	-32026.16	-32026.16	-32026.16	-32026.16	-32026.16	-32026.16	-32026.16	-32026.16	-32026.16	-32026.16	-32026.16	-32026.16	-32026.16	-32026.16	-32026.16	-32026.16	-32026.16	-32026.16	-32026.16	-32002.7	-31988.68	-31964.56	-31915.4	-31862.74	-31781.03	-31706.39
445	-32026.16	-32026.16	-32026.16	-32026.16	-32026.16	-32026.16	-32026.16	-32026.16	-32026.16	-32026.16	-32026.16	-32026.16	-32026.16	-32026.16	-32026.16	-32026.16	-32026.16	-32026.16	-32026.16	-32026.16	-32026.16	-32026.16	-32026.16	-32026.16	-32026.16	-32026.16	-32026.16	-32026.16	-32026.16	-32026.16	-32026.16	-32026.16	-32023.4	-31998.08	-31977	-31951.72	-31903.51	-31851.49	-31781.27
450	-32026.16	-32026.16	-32026.16	-32026.16	-32026.16	-32026.16	-32026.16	-32026.16	-32026.16	-32026.16	-32026.16	-32026.16	-32026.16	-32026.16	-32026.16	-32026.16	-32026.16	-32026.16	-32026.16	-32026.16	-32026.16	-32026.16	-32026.16	-32026.16	-32026.16	-32026.16	-32026.16	-32026.16	-32026.16	-32026.16	-32026.16	-32026.16	-32026.16	-32007.02	-31989.45	-31977	-31933.17	-31893.57	-31837.9
455	-32026.16	-32026.16	-32026.16	-32026.16	-32026.16	-32026.16	-32026.16	-32026.16	-32026.16	-32026.16	-32026.16	-32026.16	-32026.16	-32026.16	-32026.16	-32026.16	-32026.16	-32026.16	-32026.16	-32026.16	-32026.16	-32026.16	-32026.16	-32026.16	-32026.16	-32026.16	-32026.16	-32026.16	-32026.16	-32026.16	-32026.16	-32026.16	-32026.16	-32011.67	-31993.98	-31977	-31950.08	-31903.35	-31865.66
460	-32026.16	-32026.16	-32026.16	-32026.16	-32026.16	-32026.16	-32026.16	-32026.16	-32026.16	-32026.16	-32026.16	-32026.16	-32026.16	-32026.16	-32026.16	-32026.16	-32026.16	-32026.16	-32026.16	-32026.16	-32026.16	-32026.16	-32026.16	-32026.16	-32026.16	-32026.16	-32026.16	-32026.16	-32026.16	-32026.16	-32026.16	-32026.16	-32026.16	-32023.4	-32002.7	-31980.72	-31967.69	-31923.64	-31889.26
465	-32026.16	-32026.16	-32026.16	-32026.16	-32026.16	-32026.16	-32026.16	-32026.16	-32026.16	-32026.16	-32026.16	-32026.16	-32026.16	-32026.16	-32026.16	-32026.16	-32026.16	-32026.16	-32026.16	-32026.16	-32026.16	-32026.16	-32026.16	-32026.16	-32026.16	-32026.16	-32026.16	-32026.16	-32026.16	-32026.16	-32026.16	-32026.16	-32026.16	-32026.16	-32011.67	-31990	-31980.72	-31962.17	-31906.78
470	-32026.16	-32026.16	-32026.16	-32026.16	-32026.16	-32026.16	-32026.16	-32026.16	-32026.16	-32026.16	-32026.16	-32026.16	-32026.16	-32026.16	-32026.16	-32026.16	-32026.16	-32026.16	-32026.16	-32026.16	-32026.16	-32026.16	-32026.16	-32026.16	-32026.16	-32026.16	-32026.16	-32026.16	-32026.16	-32026.16	-32026.16	-32026.16	-32026.16	-32026.16	-32023.15	-31998.08	-31985.43	-31969.82	-31936.71
475	-32026.16	-32026.16	-32026.16	-32026.16	-32026.16	-32026.16	-32026.16	-32026.16	-32026.16	-32026.16	-32026.16	-32026.16	-32026.16	-32026.16	-32026.16	-32026.16	-32026.16	-32026.16	-32026.16	-32026.16	-32026.16	-32026.16	-32026.16	-32026.16	-32026.16	-32026.16	-32026.16	-32026.16	-32026.16	-32026.16	-32026.16	-32026.16	-32026.16	-32026.16	-32026.16	-32011.67	-31994.37	-31977	-31952.52
480	-32026.16	-32026.16	-32026.16	-32026.16	-32026.16	-32026.16	-32026.16	-32026.16	-32026.16	-32026.16	-32026.16	-32026.16	-32026.16	-32026.16	-32026.16	-32026.16	-32026.16	-32026.16	-32026.16	-32026.16	-32026.16	-32026.16	-32026.16	-32026.16	-32026.16	-32026.16	-32026.16	-32026.16	-32026.16	-32026.16	-32026.16	-32026.16	-32026.16	-32026.16	-32026.16	-32019.85	-32003.55	-31986.13	-31972.6
485	-32026.16	-32026.16	-32026.16	-32026.16	-32026.16	-32026.16	-32026.16	-32026.16	-32026.16	-32026.16	-32026.16	-32026.16	-32026.16	-32026.16	-32026.16	-32026.16	-32026.16	-32026.16	-32026.16	-32026.16	-32026.16	-32026.16	-32026.16	-32026.16	-32026.16	-32026.16	-32026.16	-32026.16	-32026.16	-32026.16	-32026.16	-32026.16	-32026.16	-32026.16	-32026.16	-32025.3	-32016.08	-31994.58	-31986.13
490	-32026.16	-32026.16	-32026.16	-32026.16	-32026.16	-32026.16	-32026.16	-32026.16	-32026.16	-32026.16	-32026.16	-32026.16	-32026.16	-32026.16	-32026.16	-32026.16	-32026.16	-32026.16	-32026.16	-32026.16	-32026.16	-32026.16	-32026.16	-32026.16	-32026.16	-32026.16	-32026.16	-32026.16	-32026.16	-32026.16	-32026.16	-32026.16	-32026.16	-32026.16	-32026.16	-32026.16	-32019.85	-32016.08	-31990.81
495	-32026.16	-32026.16	-32026.16	-32026.16	-32026.16	-32026.16	-32026.16	-32026.16	-32026.16	-32026.16	-32026.16	-32026.16	-32026.16	-32026.16	-32026.16	-32026.16	-32026.16	-32026.16	-32026.16	-32026.16	-32026.16	-32026.16	-32026.16	-32026.16	-32026.16	-32026.16	-32026.16	-32026.16	-32026.16	-32026.16	-32026.16	-32026.16	-32026.16	-32026.16	-32026.16	-32026.16	-32023.04	-32016.08	-31999.27
500	-32026.16	-32026.16	-32026.16	-32026.16	-32026.16	-32026.16	-32026.16	-32026.16	-32026.16	-32026.16	-32026.16	-32026.16	-32026.16	-32026.16	-32026.16	-32026.16	-32026.16	-32026.16	-32026.16	-32026.16	-32026.16	-32026.16	-32026.16	-32026.16	-32026.16	-32026.16	-32026.16	-32026.16	-32026.16	-32026.16	-32026.16	-32026.16	-32026.16	-32026.16	-32026.16	-32026.16	-32026.16	-32023.04	-32012.01
