2013-04,JUAN RAMON ORTIZ LOPEZ        ,150335.28,70.77932203389830508474576271185,
2013-04,MOISES CACERES DELGADO        ,156550.97,72.47730092592592592592592592592,
2013-04,REINALDO NAVARRETTE           ,230756.76,71.22122222222222222222222222223,
2013-04,WALTER ANAEL LOPEZ CHAVER     ,59638.32,70.998,
2013-05,JUAN RAMON ORTIZ LOPEZ        ,17759.52,73.998,
2013-05,MOISES CACERES DELGADO        ,155097.0,76.36373076923076923076923076924,
2013-05,RAUL VELASQUEZ                ,27359.64,75.999,
2013-05,REINALDO NAVARRETTE           ,97677.36,73.998,
2013-05,WALTER ANAEL LOPEZ CHAVER     ,71038.08,73.998,
