
There is no previous '?' to match a ':' on line 1
1: ...                               Pagina: 1
                                           ^

2: Facrep001                                                  PERIO ...
   ^                                                                   
found bareword where operator expected

Missing ';' above?

2: ...              PERIODO DEL 01/01/2021 AL 31/01/2021                ...
                                      ---- ^                               
found bareword where operator expected (previous token underlined)

2: ...                                     Fecha : 06/Feb/2021
                                           ^                  
found bareword where operator expected (previous token underlined)

There is no previous '?' to match a ':' on line 2
2: ...                               Fecha : 06/Feb/2021
                                           ^

3: DISTRIBUIDORA LA ESTACION                                        ...
   ^                                                                   
found bareword where operator expected

Missing ';' above?

There is no previous '?' to match a ':' on line 3
3: ...                               Hora  : 16:42:24
                                           ^

There is no previous '?' to match a ':' on line 3
3: ...                           Hora  : 16:42:24
                                           ^

There is no previous '?' to match a ':' on line 3
3: ...                        Hora  : 16:42:24
                                           ^

4: ________________________________________________________________ ...
   ^                                                                   
found bareword where operator expected

Missing ';' above?

9: 02/01/2021     1,278.00      10,080.00    2,971.00       8,387.0 ...
         ----     ^                                                    
found Number where operator expected (previous token underlined)
No further warnings will be given
