ajusted^mmerlk^2^4^1^
ajusted^invcod1^0^15^2^
ajusted^mmercant^5^2050^3^
ajusted^mmercost^8^3330^4^
ajusteg^mmerdoc^0^15^1^
ajusteg^femovme^7^4^2^
ajusteg^tipmov^0^1^3^
ajusteg^motivo^0^1^4^
ajusteg^lugar^0^1^5^
ajusteg^mmerlk^262^4^6^
catven^vencod^0^5^1^
catven^vennom^0^40^2^
compras^empcod^1^2^1^
compras^codprov^0^10^2^
compras^docnum^0^12^3^
compras^tipdoc^0^2^4^
compras^fecha^7^4^5^
compras^descripcion^0^35^6^
compras^valor1^8^2818^7^
compras^iva^8^2818^8^
compras^complink^262^4^9^
comprasd^complink^2^4^1^
comprasd^concod^0^12^2^
comprasd^tipmov^0^1^3^
comprasd^valor^8^2818^4^
cxcmst^clicod^2^4^1^
cxcmst^nombre^0^20^2^
cxcmst^apellido^0^30^3^
cxcmst^observ1^0^40^4^
cxcmst^observ2^0^40^5^
cxcmst^saludo^0^6^6^
cxcmst^direc1^0^40^7^
cxcmst^direc2^0^40^8^
cxcmst^ciudad^0^20^9^
cxcmst^depto^0^20^10^
cxcmst^tele^0^13^11^
cxcmst^nit^0^20^12^
cxcmst^tipo^0^1^13^
cxcmst^porcent^5^1282^14^
cxcmst^diacred^1^2^15^
cxcmst^licred^8^3330^16^
cxcmst^saldo^8^3330^17^
cxcmst^compa^0^80^18^
cxcmst^dpi_cui^0^20^19^
dmenprog^linkmenp^262^4^1^
dmenprog^gru_id^2^4^2^
dmenprog^prog_id^2^4^3^
dmenprog^userid^269^10^4^
dmenprog^fectran^266^3594^5^
doccance^documlk^2^4^1^
doccance^doclkc^2^4^2^
doccance^valor^8^3330^3^
doccat^tipdoc^0^2^1^
doccat^docdesc^0^12^2^
doccat^docsiginv^1^2^3^
docgt^anio^1^2^1^
docgt^mes^1^2^2^
docgt^documlk^262^4^3^
docgt^tipdoc^0^2^4^
docgt^docnum^0^10^5^
docgt^fedoc^7^4^6^
docgt^vencod^0^5^7^
docgt^ordrep^2^4^8^
docgt^credito^0^1^9^
docgt^clicod^2^4^10^
docgt^documst^0^1^11^
docgt^costo^8^3330^12^
docgt^subtotal^8^3330^13^
docgt^descuento^8^3330^14^
docgt^impuesto^8^3330^15^
docgt^devol^8^3330^16^
docgt^saldo^8^3330^17^
docgt^fecan^7^4^18^
docgt2^anio^1^2^1^
docgt2^mes^1^2^2^
docgt2^documlk^262^4^3^
docgt2^tipdoc^0^2^4^
docgt2^docnum^0^10^5^
docgt2^fedoc^7^4^6^
docgt2^vencod^0^5^7^
docgt2^ordrep^2^4^8^
docgt2^credito^0^1^9^
docgt2^clicod^2^4^10^
docgt2^documst^0^1^11^
docgt2^costo^8^3330^12^
docgt2^subtotal^8^3330^13^
docgt2^descuento^8^3330^14^
docgt2^impuesto^8^3330^15^
docgt2^devol^8^3330^16^
docgt2^saldo^8^3330^17^
docgt2^fecan^7^4^18^
docgt3^anio^1^2^1^
docgt3^mes^1^2^2^
docgt3^documlk^262^4^3^
docgt3^tipdoc^0^2^4^
docgt3^docnum^0^10^5^
docgt3^fedoc^7^4^6^
docgt3^vencod^0^5^7^
docgt3^ordrep^2^4^8^
docgt3^credito^0^1^9^
docgt3^clicod^2^4^10^
docgt3^documst^0^1^11^
docgt3^costo^8^3330^12^
docgt3^subtotal^8^3330^13^
docgt3^descuento^8^3330^14^
docgt3^impuesto^8^3330^15^
docgt3^devol^8^3330^16^
docgt3^saldo^8^3330^17^
docgt3^fecan^7^4^18^
documd^documlk^2^4^1^
documd^invcod1^0^15^2^
documd^cantdet^2^4^3^
documd^costodet^8^3330^4^
documd^valordet^8^3330^5^
documd^linea^1^2^6^
documg^anio^1^2^1^
documg^mes^1^2^2^
documg^documlk^262^4^3^
documg^tipdoc^0^2^4^
documg^docnum^0^10^5^
documg^fedoc^7^4^6^
documg^vencod^0^5^7^
documg^ordrep^2^4^8^
documg^credito^0^1^9^
documg^clicod^2^4^10^
documg^documst^0^1^11^
documg^costo^8^3330^12^
documg^subtotal^8^3330^13^
documg^descuento^8^3330^14^
documg^impuesto^8^3330^15^
documg^devol^8^3330^16^
documg^saldo^8^3330^17^
documg^fecan^7^4^18^
empre^empcod^1^2^1^
empre^empnom^0^40^2^
empre^direc1^0^40^3^
empre^tele^0^15^4^
empre^nit^0^10^5^
empresas1^bodega^257^2^1^
empresas1^nit^256^15^2^
empresas1^razon_social^0^70^3^
empresas1^nom_sucursal^0^70^4^
empresas1^cod_sucursal^0^3^5^
empresas1^direccion1^0^70^6^
empresas1^direccion2^0^70^7^
empresas1^depto^0^20^8^
empresas1^municipio^0^20^9^
empresas1^codigo_postal^0^5^10^
empresas1^e_mail^0^50^11^
empresas1^telefonos^0^80^12^
empresas1^requestor^0^40^13^
empresas1^userface^0^20^14^
empresas1^url_services^13^250^15^
empresas1^llave_archivo^13^70^16^
empresas1^llave_pass^13^30^17^
empresas1_f^tipo_frase^257^2^1^
empresas1_f^codigo_escenario^257^2^2^
factura_log^correlativo^258^4^1^
factura_log^request_id^269^40^2^
factura_log^fac_id^258^4^3^
factura_log^fecha_envio^266^4365^4^
factura_log^fecha_finaliza^10^4365^5^
factura_log^estatus^257^2^6^
factura_log^numero_acceso^5^2304^7^
factura_log^interna_tipod^256^2^8^
factura_log^interna_serie^269^15^9^
factura_log^interna_numero^261^3840^10^
factura_log^intentos^1^2^11^
factura_log^tipo_respuesta^1^2^12^
factura_log^xml_docto^201^5120^13^
factura_log^xml_respuesta^201^10240^14^
factura_log^cod_archivo_cer^2^4^15^
factura_log^dir_arch_org^13^200^16^
factura_log^dir_arch_fir^13^200^17^
factura_log^dir_arch_cer^13^200^18^
factura_log^sat_uuid^13^40^19^
factura_log^certificador_nit^13^25^20^
factura_log^certificador_nombre^13^80^21^
factura_log^certificador_serie^0^8^22^
factura_log^certificador_numero^5^3840^23^
factura_log^certificador_fecha^10^4365^24^
factura_log^flag_error^257^2^25^
factura_log^msg_error^13^250^26^
factura_xml^cod_archivo_cer^258^4^1^
factura_xml^fecha_hora^10^4365^2^
factura_xml^archivo_xml^12^56^3^
facturafel_e^serie^0^20^1^
facturafel_e^num_doc^5^3840^2^
facturafel_e^tipod^0^2^3^
facturafel_e^fecha^7^4^4^
facturafel_e^fecha_em^0^35^5^
facturafel_e^fecha_anul^0^35^6^
facturafel_e^num_aut^0^20^7^
facturafel_e^fecha_re^0^15^8^
facturafel_e^rango_i^5^3072^9^
facturafel_e^rango_f^5^3072^10^
facturafel_e^from^0^50^11^
facturafel_e^to^0^50^12^
facturafel_e^cc^0^50^13^
facturafel_e^formats^0^10^14^
facturafel_e^tipo_doc^0^12^15^
facturafel_e^estado_doc^0^20^16^
facturafel_e^ant_serie^13^20^17^
facturafel_e^ant_numdoc^5^3840^18^
facturafel_e^ant_fecemi^7^4^19^
facturafel_e^ant_resoluc^13^30^20^
facturafel_e^c_moneda^0^3^21^
facturafel_e^tipo_cambio^0^10^22^
facturafel_e^info_reg^0^15^23^
facturafel_e^num_int^5^5120^24^
facturafel_e^nit_e^0^12^25^
facturafel_e^nombre_c^0^70^26^
facturafel_e^idioma_e^0^2^27^
facturafel_e^nombre_e^0^70^28^
facturafel_e^codigo_e^0^3^29^
facturafel_e^dispositivo_e^0^3^30^
facturafel_e^direccion_e^0^70^31^
facturafel_e^departamento_e^0^20^32^
facturafel_e^municipio_e^0^20^33^
facturafel_e^pais_e^0^2^34^
facturafel_e^codpos_e^5^1280^35^
facturafel_e^nit_r^0^20^36^
facturafel_e^es_cui^1^2^37^
facturafel_e^nombre_r^0^100^38^
facturafel_e^idioma_r^0^2^39^
facturafel_e^direccion_r^0^150^40^
facturafel_e^departamento_r^0^20^41^
facturafel_e^municipio_r^0^20^42^
facturafel_e^pais_r^0^2^43^
facturafel_e^codpos_r^5^1280^44^
facturafel_e^total_b^5^2562^45^
facturafel_e^total_d^5^2562^46^
facturafel_e^monto_d^5^2562^47^
facturafel_e^total_i^5^2562^48^
facturafel_e^ing_netosg^5^2562^49^
facturafel_e^total_iva1^5^2562^50^
facturafel_e^tipo1^0^10^51^
facturafel_e^base1^5^2562^52^
facturafel_e^tasa1^5^2562^53^
facturafel_e^monto1^5^2562^54^
facturafel_e^total_neto^5^2562^55^
facturafel_e^serie_e^0^20^56^
facturafel_e^numdoc_e^0^40^57^
facturafel_e^autorizacion^0^200^58^
facturafel_e^estatus^0^2^59^
facturafel_e^fac_id^262^4^60^
facturafel_e^p_descuento^5^2310^61^
facturafel_e^mto_descuento^5^3586^62^
facturafel_e^fel_msg^2^4^63^
facturafel_e^id_factura^2^4^64^
facturafel_e^total_en_letras^0^250^65^
facturafel_e^tipo_pago^0^2^66^
facturafel_e^num_oc^0^20^67^
facturafel_e^un_pago_de^5^3586^68^
facturafel_e^npagos^1^2^69^
facturafel_e^mto_pago^5^3586^70^
facturafel_e^dia_pago^1^2^71^
facturafel_e^fecha_pago^7^4^72^
facturafel_e^nom_firma^0^80^73^
facturafel_e^dpi_firma^0^20^74^
facturafel_e^vencod^0^5^75^
facturafel_e^marca^0^25^76^
facturafel_e^modelo^0^25^77^
facturafel_e^serie_planta^0^25^78^
facturafel_e^nota1^0^75^79^
facturafel_e^documlk^2^4^80^
facturafel_e^num_interno^0^20^81^
facturafel_e^clicod^0^20^82^
facturafel_e^excenta^0^1^83^
facturafel_e^ordrep^2^4^84^
facturafel_e^valor_mo^5^3074^85^
facturafel_e^desc_mo^5^3074^86^
facturafel_e^valor_ma^5^3074^87^
facturafel_e^desc_ma^5^3074^88^
facturafel_e^valor_tf^5^3074^89^
facturafel_e^contacto_exp^0^60^90^
facturafel_e^id_exp^0^50^91^
facturafel_ed^fac_id^2^4^1^
facturafel_ed^serie^0^20^2^
facturafel_ed^num_doc^5^3840^3^
facturafel_ed^tipod^0^2^4^
facturafel_ed^fecha^7^4^5^
facturafel_ed^descrip_p^0^100^6^
facturafel_ed^codigo_p^0^14^7^
facturafel_ed^unidad_m^0^3^8^
facturafel_ed^cantidad^5^2560^9^
facturafel_ed^precio_u^5^3586^10^
facturafel_ed^precio_t^5^5126^11^
facturafel_ed^descto_t^5^5126^12^
facturafel_ed^descto_m^5^5126^13^
facturafel_ed^precio_p^5^5126^14^
facturafel_ed^precio_m^5^5126^15^
facturafel_ed^total_imp^5^5126^16^
facturafel_ed^ing_netos^5^5126^17^
facturafel_ed^total_iva^5^5126^18^
facturafel_ed^tipo^0^15^19^
facturafel_ed^base^5^5126^20^
facturafel_ed^tasa^5^5126^21^
facturafel_ed^monto^5^5126^22^
facturafel_ed^categoria^0^10^23^
facturafel_ed^txt_especial^0^1^24^
facturafel_ed^txt_largo^201^4096^25^
facturafel_ed^linea^1^2^26^
facxrep^ordrep^2^4^1^
facxrep^numfac^0^15^2^
facxrep^fecha^7^4^3^
facxrep^valor^5^3330^4^
facxrep^st^0^1^5^
hisrepro^anio^2^4^1^
hisrepro^mes^2^4^2^
hisrepro^cospro^5^3330^3^
hisrepro^venpro^5^3330^4^
hisrepro^facturado^5^3330^5^
hisrepro^piva^5^1282^6^
hisrepro^numfac^2^4^7^
hisrepro^numpro^2^4^8^
inv_inicio^invcod1^256^15^1^
inv_inicio^fecha^263^4^2^
inv_inicio^existe^2^4^3^
inv_inicio^existes^2^4^4^
inv_inicio^existes2^2^4^5^
inv_inicio^exi3^2^4^6^
inv_iniciof^fecha^7^4^1^
invaju^control^262^4^1^
invaju^numaju^2^4^2^
invaju^fecha^7^4^3^
invaju^hora^0^8^4^
invaju^usuario^0^10^5^
invaju^tipaju^0^1^6^
invaju^invcod1^0^15^7^
invaju^cantidad^2^4^8^
invaju^costo^5^3330^9^
invaju^razon^0^40^10^
invegen^invcod1^0^15^1^
invegen^muela^0^2^2^
invegen^invcod2^0^11^3^
invegen^descri^0^40^4^
invegen^aplica^0^65^5^
invegen^localiza^0^11^6^
invegen^existes^2^4^7^
invegen^existes2^2^4^8^
invegen^exi3^2^4^9^
invegen^exi4^2^4^10^
invegen^exi5^2^4^11^
invegen^rempo^0^15^12^
invegen^codprov^0^3^13^
invegen^uvehi^1^2^14^
invegen^clase^0^2^15^
invegen^costo^8^3330^16^
invegen^precio^8^3330^17^
invegen^existe^2^4^18^
invegen^minimo^2^4^19^
invegen^maximo^2^4^20^
invegen^rempa^0^15^21^
invegen^exifin^2^4^22^
invegen^costfin^8^3330^23^
invegen^exifco^2^4^24^
invegeni^invcod1^0^15^1^
invegeni^muela^0^2^2^
invegeni^invcod2^0^11^3^
invegeni^descri^0^40^4^
invegeni^aplica^0^65^5^
invegeni^localiza^0^11^6^
invegeni^existes^2^4^7^
invegeni^existes2^2^4^8^
invegeni^exi3^2^4^9^
invegeni^exi4^2^4^10^
invegeni^exi5^2^4^11^
invegeni^rempo^0^15^12^
invegeni^codprov^0^3^13^
invegeni^uvehi^1^2^14^
invegeni^clase^0^2^15^
invegeni^costo^8^3330^16^
invegeni^precio^8^3330^17^
invegeni^existe^2^4^18^
invegeni^minimo^2^4^19^
invegeni^maximo^2^4^20^
invegeni^rempa^0^15^21^
invegeni^exifin^2^4^22^
invegeni^costfin^8^3330^23^
invegeni^exifco^2^4^24^
investa^invcod1^0^15^1^
investa^investa01^2^4^2^
investa^investa02^2^4^3^
investa^investa03^2^4^4^
investa^investa04^2^4^5^
investa^investa05^2^4^6^
investa^investa06^2^4^7^
investa^investa07^2^4^8^
investa^investa08^2^4^9^
investa^investa09^2^4^10^
investa^investa10^2^4^11^
investa^investa11^2^4^12^
investa^investa12^2^4^13^
investa^investa13^2^4^14^
investa^investa14^2^4^15^
investa^investa15^2^4^16^
investa^investa16^2^4^17^
investa^investa17^2^4^18^
investa^investa18^2^4^19^
investa^investa19^2^4^20^
investa^investa20^2^4^21^
investa^investa21^2^4^22^
investa^investa22^2^4^23^
investa^investa23^2^4^24^
investa^investa24^2^4^25^
investad^invcod1^0^15^1^
investad^depo^1^2^2^
investad^investa01^2^4^3^
investad^investa02^2^4^4^
investad^investa03^2^4^5^
investad^investa04^2^4^6^
investad^investa05^2^4^7^
investad^investa06^2^4^8^
investad^investa07^2^4^9^
investad^investa08^2^4^10^
investad^investa09^2^4^11^
investad^investa10^2^4^12^
investad^investa11^2^4^13^
investad^investa12^2^4^14^
investad^investa13^2^4^15^
investad^investa14^2^4^16^
investad^investa15^2^4^17^
investad^investa16^2^4^18^
investad^investa17^2^4^19^
investad^investa18^2^4^20^
investad^investa19^2^4^21^
investad^investa20^2^4^22^
investad^investa21^2^4^23^
investad^investa22^2^4^24^
investad^investa23^2^4^25^
investad^investa24^2^4^26^
invhist^invcod1^0^15^1^
invhist^fecha^7^4^2^
invhist^existe^2^4^3^
invhist^deposito^1^2^4^
invmmerd^mmerlk^2^4^1^
invmmerd^invcod1^0^15^2^
invmmerd^mmercant^5^2050^3^
invmmerd^entrega^1^2^4^
invmmerd^pide^1^2^5^
invmmerg^empcod^1^2^1^
invmmerg^mmerdoc^0^15^2^
invmmerg^femovme^7^4^3^
invmmerg^tipmov^0^1^4^
invmmerg^entrega^1^2^5^
invmmerg^pide^1^2^6^
invmmerg^stat^0^1^7^
invmmerg^or^0^1^8^
invmmerg^mmerlk^262^4^9^
invpbod^depo^1^2^1^
invpbod^invcod1^0^15^2^
invpbod^canti^2^4^3^
invpedd2^pedcod^0^8^1^
invpedd2^invcod1^0^15^2^
invpedd2^fingreso^7^4^3^
invpedd2^anio^1^2^4^
invpedd2^mes^1^2^5^
invpedd2^exisant^2^4^6^
invpedd2^cantreci^2^4^7^
invpedd2^costant^5^3330^8^
invpedd2^costbod^5^3330^9^
invpedd2^costnet^5^3330^10^
invpedd2^costdif^5^3330^11^
invpedi^invcod1^0^15^1^
invpedi^fepedi^0^5^2^
invpedi^pedcod^0^8^3^
invpedi^pedcant^2^4^4^
invpedi^fereci^0^5^5^
invpedi^pedfac^0^6^6^
invpedi^cantreci^2^4^7^
invpedi^fecrea^7^4^8^
invpedid^pedcod^0^8^1^
invpedid^invcod1^0^15^2^
invpedid^cantreci^2^4^3^
invpedid^costo^8^3330^4^
invpedid^costbod^8^3330^5^
invpedig^pedcod^0^8^1^
invpedig^fereci^0^5^2^
invpedig^fingreso^7^4^3^
invpedig^pedfac^0^6^4^
invpedig^valtot^8^3330^5^
invpedig^gtstot^8^3330^6^
invpedig^pedstat^0^1^7^
invperp^anio^2^4^1^
invperp^mes^2^4^2^
invperp^invcod1^0^15^3^
invperp^cosant^5^3330^4^
invperp^coscar^5^3330^5^
invperp^cosdes^5^3330^6^
invperp^cosdan^5^3330^7^
invperp^cosdme^5^3330^8^
invprov^invcod1^0^15^1^
invprov^codprov^0^3^2^
invprov^invcodprov^0^15^3^
invprov^costoprov^8^3330^4^
invprov^upaquete^1^2^5^
invrempo^invcod1^0^15^1^
invrempo^invcod2^0^15^2^
invrota^cod^0^2^1^
invrota^ran11^2^4^2^
invrota^ran12^2^4^3^
invrota^ran21^2^4^4^
invrota^ran22^2^4^5^
invrota^ran31^2^4^6^
invrota^ran32^2^4^7^
invrota^ran41^2^4^8^
invrota^ran42^2^4^9^
invrota^ran51^2^4^10^
invrota^ran52^2^4^11^
invrotad^rango^1^2^1^
invrotad^invcod1^0^15^2^
invrotad^costo^5^3330^3^
invrotad^unidades^2^4^4^
kardex^documlk^262^4^1^
kardex^fedoc^7^4^2^
kardex^tipdoc^0^2^3^
kardex^docnum^0^10^4^
kardex^invcod1^0^15^5^
kardex^cantdet^2^4^6^
karmov^mmerlk^2^4^1^
karmov^invcod1^0^15^2^
karmov^mmercant^5^2050^3^
karmov^empcod^1^2^4^
karmov^mmerdoc^0^15^5^
karmov^femovme^7^4^6^
karmov^entrega^1^2^7^
karmov^pide^1^2^8^
karmov^or^0^1^9^
maccopcusu^usu_id^258^4^1^
maccopcusu^linkprop^258^4^2^
modcxc^clicod^2^4^1^
modcxc^fecha^7^4^2^
modcxc^accion^0^1^3^
modexi^invcod1^0^15^1^
modexi^fecha^7^4^2^
modexi^accion^0^1^3^
ndocu_desc^documlk^2^4^1^
ndocu_desc^linea^1^2^2^
ndocu_desc^cantidad^1^2^3^
ndocu_desc^invcod1^0^15^4^
ndocu_desc^descri^0^75^5^
ndocu_desc^preciou^5^2562^6^
ndocu_desc^preciot^5^2562^7^
ndocu_nota^documlk^2^4^1^
ndocu_nota^fac_id^2^4^2^
ndocu_oc^documlk^2^4^1^
ndocu_oc^num_oc^0^20^2^
ndocu_pag^documlk^2^4^1^
ndocu_pag^un_pago_de^5^3586^2^
ndocu_pag^npagos^1^2^3^
ndocu_pag^mto_pago^5^3586^4^
ndocu_pag^dia_pago^1^2^5^
ndocu_pag^fecha_pago^7^4^6^
ndocu_pag^nom_firma^0^80^7^
ndocu_pag^dpi_firma^0^20^8^
ndocumd^documlk^2^4^1^
ndocumd^invcod1^0^15^2^
ndocumd^cantdet^2^4^3^
ndocumd^costodet^8^3330^4^
ndocumd^valordet^8^3330^5^
ndocumd^linea^1^2^6^
ndocumd^descripcion^0^200^7^
ndocumd^b_s^0^1^8^
ndocumg^anio^1^2^1^
ndocumg^mes^1^2^2^
ndocumg^documlk^2^4^3^
ndocumg^tipdoc^0^2^4^
ndocumg^docnum^2^4^5^
ndocumg^fedoc^7^4^6^
ndocumg^vencod^0^5^7^
ndocumg^ordrep^2^4^8^
ndocumg^credito^0^1^9^
ndocumg^clicod^2^4^10^
ndocumg^tienda^1^2^11^
ndocumg^serie_doc^0^20^12^
ndocumg^nit^0^20^13^
ndocumg^nombre^0^100^14^
ndocumg^direc1^0^100^15^
ndocumg^marca^0^25^16^
ndocumg^modelo^0^25^17^
ndocumg^serie_planta^0^25^18^
ndocumg^codmon^1^2^19^
ndocumg^pordes^5^2310^20^
ndocumg^porimp^5^1796^21^
ndocumg^tc^5^2566^22^
ndocumg^b_s^0^1^23^
ndocumg^estado^0^1^24^
ndocumg^regimen^0^1^25^
ndocumg^nota1^0^75^26^
ndocumg^documst^0^1^27^
ndocumg^costo^5^3330^28^
ndocumg^subtotal^5^3330^29^
ndocumg^descuento^5^3330^30^
ndocumg^impuesto^5^3330^31^
ndocumg^devol^5^3330^32^
ndocumg^saldo^5^3330^33^
ndocumg^fecan^7^4^34^
ndocumg^excenta^0^1^35^
pedcolo^codprov^0^5^1^
pedcolo^fecha^0^7^2^
pedcolo^pedcod^0^8^3^
pedcolo^fob^5^3330^4^
pedcolo^recibo^0^6^5^
peract^aplica^1^2^1^
peract^anio^1^2^2^
peract^mes^1^2^3^
peract^fmodifica^7^4^4^
profd^documlk^2^4^1^
profd^invcod1^0^15^2^
profd^cantdet^2^4^3^
profd^costodet^8^3330^4^
profd^valordet^8^3330^5^
profg^tienda^1^2^1^
profg^nombre^0^60^2^
profg^nit^0^12^3^
profg^direc1^0^40^4^
profg^telclie^0^10^5^
profg^tipvh^0^50^6^
profg^serie^0^2^7^
profg^docnum^2^4^8^
profg^fedoc^7^4^9^
profg^vencod^0^5^10^
profg^descu^1^2^11^
profg^factura^0^10^12^
profg^clicod^2^4^13^
profg^documst^0^1^14^
profg^costo^8^3330^15^
profg^subtotal^8^3330^16^
profg^descuento^8^3330^17^
profg^impuesto^8^3330^18^
profg^total^8^3330^19^
profg^documlk^262^4^20^
provext^codprov^0^10^1^
provext^nombre^0^35^2^
provext^contacto1^0^35^3^
provext^contacto2^0^35^4^
provext^contacto3^0^35^5^
provext^direccion1^0^35^6^
provext^direccion2^0^35^7^
provext^fax^0^35^8^
provext^tel^0^35^9^
provext^email^0^40^10^
prvmst^codprov^0^10^1^
prvmst^nomprov^0^50^2^
prvmst^direc^0^45^3^
prvmst^telefono^0^15^4^
prvmst^numnit^0^10^5^
prvmst^contri^0^1^6^
prvmst^dcredit^1^2^7^
requisi^marca^0^15^1^
requisi^anio^1^2^2^
requisi^modelo^0^15^3^
requisi^documlk^2^4^4^
series^tipdoc^0^2^1^
series^serie^2^4^2^
seritras^sucu^1^2^1^
seritras^tipdoc^0^2^2^
seritras^serie^0^15^3^
seritras^serie_sat^0^20^4^
seritras^envia_sat^0^1^5^
sucur^invcod1^0^15^1^
sucur^existe^2^4^2^
t_documd^documlk^2^4^1^
t_documd^invcod1^0^15^2^
t_documd^cantdet^2^4^3^
t_documd^costodet^8^3330^4^
t_documd^valordet^8^3330^5^
t_documd^docnum^0^15^6^
t_documg^anio^1^2^1^
t_documg^mes^1^2^2^
t_documg^documlk^262^4^3^
t_documg^tipdoc^0^2^4^
t_documg^docnum^0^10^5^
t_documg^fedoc^7^4^6^
t_documg^vencod^0^5^7^
t_documg^ordrep^2^4^8^
t_documg^credito^0^1^9^
t_documg^clicod^2^4^10^
t_documg^documst^0^1^11^
t_documg^costo^8^3330^12^
t_documg^subtotal^8^3330^13^
t_documg^descuento^8^3330^14^
t_documg^impuesto^8^3330^15^
t_documg^devol^8^3330^16^
t_documg^saldo^8^3330^17^
t_documg^fecan^7^4^18^
uno^cod^1^2^1^
uno^desc^0^100^2^
