actpro^cditem^2^4^1^
actpro^dsitem^0^100^2^
actpro^codabr^0^30^3^
empresas1^bodega^257^2^1^
empresas1^nit^256^15^2^
empresas1^razon_social^0^70^3^
empresas1^nom_sucursal^0^70^4^
empresas1^cod_sucursal^0^3^5^
empresas1^direccion1^0^70^6^
empresas1^direccion2^0^70^7^
empresas1^depto^0^20^8^
empresas1^municipio^0^20^9^
empresas1^codigo_postal^0^5^10^
empresas1^e_mail^0^50^11^
empresas1^telefonos^0^80^12^
empresas1^requestor^0^40^13^
empresas1^userface^0^20^14^
empresas1^url_services^13^250^15^
empresas1^llave_archivo^13^70^16^
empresas1^llave_pass^13^30^17^
empresas1^url_anulacion^13^250^18^
empresas1_f^tipo_frase^257^2^1^
empresas1_f^codigo_escenario^257^2^2^
fac_clientes^codcli^262^4^1^
fac_clientes^nomcli^256^60^2^
fac_clientes^numnit^256^30^3^
fac_clientes^numtel^0^30^4^
fac_clientes^nmovil^0^15^5^
fac_clientes^dircli^256^100^6^
fac_clientes^nompro^0^60^7^
fac_clientes^bemail^0^100^8^
fac_clientes^estado^257^2^9^
fac_clientes^userid^256^15^10^
fac_clientes^fecsis^263^4^11^
fac_clientes^horsis^266^1642^12^
fac_dtdoctos^lnktra^258^4^1^
fac_dtdoctos^correl^257^2^2^
fac_dtdoctos^codbco^257^2^3^
fac_dtdoctos^numdoc^269^50^4^
fac_dtdoctos^totval^261^2050^5^
fac_dtdoctos^prefec^257^2^6^
fac_dtdoctos^feccob^7^4^7^
fac_dtdoctos^observ^13^100^8^
fac_dtransac^lnktra^258^4^1^
fac_dtransac^correl^257^2^2^
fac_dtransac^codemp^257^2^3^
fac_dtransac^codsuc^257^2^4^
fac_dtransac^codbod^257^2^5^
fac_dtransac^cditem^258^4^6^
fac_dtransac^codabr^256^20^7^
fac_dtransac^dsitem^13^250^8^
fac_dtransac^unimed^257^2^9^
fac_dtransac^codepq^257^2^10^
fac_dtransac^canepq^261^3586^11^
fac_dtransac^pbruto^261^3586^12^
fac_dtransac^cantid^261^3586^13^
fac_dtransac^canbon^261^3590^14^
fac_dtransac^preuni^261^3590^15^
fac_dtransac^preori^261^3074^16^
fac_dtransac^descto^261^3074^17^
fac_dtransac^pordes^261^1282^18^
fac_dtransac^totpro^261^3586^19^
fac_dtransac^factor^261^3590^20^
fac_dtransac^cliesp^257^2^21^
fac_dtransac^rebaja^257^2^22^
fac_dtransac^pesado^257^2^23^
fac_dtransac^porisv^5^1282^24^
fac_dtransac^totisv^5^3074^25^
fac_dvicorte^lnkcor^258^4^1^
fac_dvicorte^numpos^257^2^2^
fac_dvicorte^fecemi^263^4^3^
fac_dvicorte^numdoc^256^20^4^
fac_dvicorte^totval^261^3074^5^
fac_dvicorte^codaut^257^2^6^
fac_dvicorte^observ^0^100^7^
fac_dvicorte^correl^257^2^8^
fac_dvicorte^userid^256^15^9^
fac_dvicorte^horsis^266^1642^10^
fac_emitacre^codemi^257^2^1^
fac_emitacre^nomemi^269^40^2^
fac_emitacre^nomabr^256^12^3^
fac_emitacre^userid^256^15^4^
fac_emitacre^fecsis^263^4^5^
fac_emitacre^horsis^266^1642^6^
fac_formaimp^lnktdc^258^4^1^
fac_formaimp^top001^13^100^2^
fac_formaimp^top002^13^100^3^
fac_formaimp^top003^13^100^4^
fac_formaimp^top004^13^100^5^
fac_formaimp^top005^13^100^6^
fac_formaimp^top006^13^100^7^
fac_formaimp^foot01^13^100^8^
fac_formaimp^foot02^13^100^9^
fac_formaimp^foot03^13^100^10^
fac_formaimp^foot04^13^100^11^
fac_formaimp^foot05^13^100^12^
fac_formaimp^foot06^13^100^13^
fac_formaimp^foot07^13^100^14^
fac_formaimp^foot08^13^100^15^
fac_formaimp^foot09^13^100^16^
fac_formaimp^foot10^13^100^17^
fac_formaimp^userid^13^15^18^
fac_formaimp^fecsis^7^4^19^
fac_formaimp^horsis^10^1642^20^
fac_mofertas^lnkofe^262^4^1^
fac_mofertas^numpos^257^2^2^
fac_mofertas^desofe^269^50^3^
fac_mofertas^fecini^263^4^4^
fac_mofertas^fecfin^263^4^5^
fac_mofertas^pordes^261^1282^6^
fac_mofertas^estado^257^2^7^
fac_mofertas^userid^13^15^8^
fac_mofertas^fecsis^263^4^9^
fac_mofertas^horsis^266^1642^10^
fac_mtransac^lnktra^262^4^1^
fac_mtransac^numpos^257^2^2^
fac_mtransac^codemp^257^2^3^
fac_mtransac^lnktdc^258^4^4^
fac_mtransac^tipdoc^257^2^5^
fac_mtransac^nserie^256^10^6^
fac_mtransac^numdoc^258^4^7^
fac_mtransac^fecemi^263^4^8^
fac_mtransac^codcli^258^4^9^
fac_mtransac^numnit^13^20^10^
fac_mtransac^nomcli^13^60^11^
fac_mtransac^dircli^13^100^12^
fac_mtransac^telcli^13^30^13^
fac_mtransac^diacre^1^2^14^
fac_mtransac^credit^257^2^15^
fac_mtransac^noruta^257^2^16^
fac_mtransac^codven^257^2^17^
fac_mtransac^numrf1^13^30^18^
fac_mtransac^ordcmp^256^20^19^
fac_mtransac^hayord^257^2^20^
fac_mtransac^exenta^257^2^21^
fac_mtransac^moneda^257^2^22^
fac_mtransac^tascam^261^3590^23^
fac_mtransac^efecti^261^3586^24^
fac_mtransac^cheque^261^3586^25^
fac_mtransac^tarcre^261^3586^26^
fac_mtransac^ordcom^261^3586^27^
fac_mtransac^depmon^261^3586^28^
fac_mtransac^subtot^261^3586^29^
fac_mtransac^totdoc^261^3586^30^
fac_mtransac^totori^261^3586^31^
fac_mtransac^totiva^261^3586^32^
fac_mtransac^poriva^261^1282^33^
fac_mtransac^totpag^261^3586^34^
fac_mtransac^monext^261^3586^35^
fac_mtransac^totdes^261^3586^36^
fac_mtransac^abonos^261^3586^37^
fac_mtransac^saldos^261^3586^38^
fac_mtransac^totapa^261^3586^39^
fac_mtransac^lnkdes^258^4^40^
fac_mtransac^estado^256^1^41^
fac_mtransac^feccor^263^4^42^
fac_mtransac^usrope^269^15^43^
fac_mtransac^userid^269^15^44^
fac_mtransac^fecsis^263^4^45^
fac_mtransac^horsis^266^1642^46^
fac_mtransac^motanl^13^100^47^
fac_mtransac^usranl^13^15^48^
fac_mtransac^fecanl^7^4^49^
fac_mtransac^horanl^10^1642^50^
fac_mtransac^lnkinv^258^4^51^
fac_mtransac^lnkapa^258^4^52^
fac_mtransac^pordes^261^1282^53^
fac_mtransac^numapa^258^4^54^
fac_mtransac^haycor^1^2^55^
fac_permxpos^numpos^257^2^1^
fac_permxpos^userid^256^15^2^
fac_permxpos^usuaid^256^15^3^
fac_permxpos^fecsis^263^4^4^
fac_permxpos^horsis^266^1642^5^
fac_permxtdc^lnktdc^258^4^1^
fac_permxtdc^userid^269^15^2^
fac_permxtdc^usuaid^256^15^3^
fac_permxtdc^fecsis^263^4^4^
fac_permxtdc^horsis^266^1642^5^
fac_puntovta^numpos^257^2^1^
fac_puntovta^nompos^269^40^2^
fac_puntovta^tipfac^257^2^3^
fac_puntovta^chkinv^257^2^4^
fac_puntovta^propin^257^2^5^
fac_puntovta^porpro^261^1282^6^
fac_puntovta^impfac^256^20^7^
fac_puntovta^impcoc^256^20^8^
fac_puntovta^impcmd^256^20^9^
fac_puntovta^codemp^257^2^10^
fac_puntovta^codsuc^257^2^11^
fac_puntovta^codbod^257^2^12^
fac_puntovta^chkexi^257^2^13^
fac_puntovta^userid^269^15^14^
fac_puntovta^fecsis^263^4^15^
fac_puntovta^horsis^266^1642^16^
fac_puntovta^sat_establecimiento^1^2^17^
fac_tarjetas^lnktra^258^4^1^
fac_tarjetas^correl^257^2^2^
fac_tarjetas^codemi^257^2^3^
fac_tarjetas^numtar^0^20^4^
fac_tarjetas^numaut^0^20^5^
fac_tarjetas^totval^261^2050^6^
fac_tdocxpos^lnktdc^262^4^1^
fac_tdocxpos^numpos^257^2^2^
fac_tdocxpos^codemp^257^2^3^
fac_tdocxpos^tipdoc^257^2^4^
fac_tdocxpos^regfac^257^2^5^
fac_tdocxpos^numcai^0^40^6^
fac_tdocxpos^fecemi^7^4^7^
fac_tdocxpos^nserie^256^10^8^
fac_tdocxpos^numcor^2^4^9^
fac_tdocxpos^numfin^2^4^10^
fac_tdocxpos^fecven^7^4^11^
fac_tdocxpos^haycor^257^2^12^
fac_tdocxpos^csmepl^1^2^13^
fac_tdocxpos^creepl^1^2^14^
fac_tdocxpos^regali^1^2^15^
fac_tdocxpos^nomdoc^256^30^16^
fac_tdocxpos^estado^256^1^17^
fac_tdocxpos^userid^256^15^18^
fac_tdocxpos^fecsis^263^4^19^
fac_tdocxpos^horsis^266^1642^20^
fac_tipodocs^tipdoc^257^2^1^
fac_tipodocs^nomdoc^269^40^2^
fac_tipodocs^nomabr^256^6^3^
fac_tipodocs^exeimp^257^2^4^
fac_tipodocs^hayimp^257^2^5^
fac_tipodocs^title1^269^20^6^
fac_tipodocs^haycmd^257^2^7^
fac_tipodocs^hayfir^257^2^8^
fac_tipodocs^hayepl^257^2^9^
fac_tipodocs^userid^256^10^10^
fac_tipodocs^fecsis^263^4^11^
fac_tipodocs^horsis^266^1642^12^
fac_tipomovs^tipmov^257^2^1^
fac_tipomovs^nommov^269^40^2^
fac_tipomovs^tipope^257^2^3^
fac_tipomovs^userid^269^15^4^
fac_tipomovs^fecsis^263^4^5^
fac_tipomovs^horsis^266^1642^6^
fac_usuaxpos^numpos^257^2^1^
fac_usuaxpos^userid^269^15^2^
fac_usuaxpos^tipusu^1^2^3^
fac_usuaxpos^passwd^269^15^4^
fac_usuaxpos^usuaid^256^15^5^
fac_usuaxpos^fecsis^263^4^6^
fac_usuaxpos^horsis^266^1642^7^
fac_vicortes^lnkcor^262^4^1^
fac_vicortes^numpos^257^2^2^
fac_vicortes^feccor^263^4^3^
fac_vicortes^tipcor^257^2^4^
fac_vicortes^observ^0^200^5^
fac_vicortes^totvta^261^3074^6^
fac_vicortes^fonini^261^3074^7^
fac_vicortes^totgas^261^3074^8^
fac_vicortes^totcor^261^3074^9^
fac_vicortes^totefe^261^3074^10^
fac_vicortes^tottar^261^3074^11^
fac_vicortes^totcon^261^3074^12^
fac_vicortes^totcre^261^3074^13^
fac_vicortes^totcos^261^3074^14^
fac_vicortes^totdon^261^3074^15^
fac_vicortes^totisv^261^3074^16^
fac_vicortes^totdes^261^4351^17^
fac_vicortes^bil500^257^2^18^
fac_vicortes^bil200^257^2^19^
fac_vicortes^bil100^257^2^20^
fac_vicortes^bil050^257^2^21^
fac_vicortes^bil020^257^2^22^
fac_vicortes^bil010^257^2^23^
fac_vicortes^bil005^257^2^24^
fac_vicortes^bil002^257^2^25^
fac_vicortes^bil001^257^2^26^
fac_vicortes^mon001^257^2^27^
fac_vicortes^mon050^257^2^28^
fac_vicortes^mon025^257^2^29^
fac_vicortes^mon020^257^2^30^
fac_vicortes^mon010^257^2^31^
fac_vicortes^mon005^257^2^32^
fac_vicortes^toecie^261^3074^33^
fac_vicortes^cbi500^257^2^34^
fac_vicortes^cbi200^257^2^35^
fac_vicortes^cbi100^257^2^36^
fac_vicortes^cbi050^257^2^37^
fac_vicortes^cbi020^257^2^38^
fac_vicortes^cbi010^257^2^39^
fac_vicortes^cbi005^257^2^40^
fac_vicortes^cbi002^257^2^41^
fac_vicortes^cbi001^257^2^42^
fac_vicortes^cmo001^257^2^43^
fac_vicortes^cmo050^257^2^44^
fac_vicortes^cmo020^257^2^45^
fac_vicortes^cmo025^257^2^46^
fac_vicortes^cmo010^257^2^47^
fac_vicortes^cmo005^257^2^48^
fac_vicortes^toecor^261^3074^49^
fac_vicortes^totdif^261^3074^50^
fac_vicortes^ttacie^261^3074^51^
fac_vicortes^todita^261^3074^52^
fac_vicortes^userid^269^15^53^
fac_vicortes^fecsis^263^4^54^
fac_vicortes^horsis^266^1642^55^
fac_vicortes^cierre^257^2^56^
fac_vicortes^usrcie^13^15^57^
fac_vicortes^feccie^7^4^58^
fac_vicortes^horcie^10^1642^59^
factura_log^correlativo^258^4^1^
factura_log^request_id^269^40^2^
factura_log^fac_id^258^4^3^
factura_log^fecha_envio^266^4365^4^
factura_log^fecha_finaliza^10^4365^5^
factura_log^estatus^257^2^6^
factura_log^numero_acceso^5^2304^7^
factura_log^interna_tipod^256^2^8^
factura_log^interna_serie^269^15^9^
factura_log^interna_numero^261^3840^10^
factura_log^intentos^1^2^11^
factura_log^tipo_respuesta^1^2^12^
factura_log^xml_docto^201^5120^13^
factura_log^xml_respuesta^201^10240^14^
factura_log^cod_archivo_cer^2^4^15^
factura_log^dir_arch_org^13^200^16^
factura_log^dir_arch_fir^13^200^17^
factura_log^dir_arch_cer^13^200^18^
factura_log^sat_uuid^13^40^19^
factura_log^certificador_nit^13^25^20^
factura_log^certificador_nombre^13^80^21^
factura_log^certificador_serie^0^8^22^
factura_log^certificador_numero^5^3840^23^
factura_log^certificador_fecha^10^4365^24^
factura_log^flag_error^257^2^25^
factura_log^msg_error^13^250^26^
factura_xml^cod_archivo_cer^258^4^1^
factura_xml^fecha_hora^10^4365^2^
factura_xml^archivo_xml^12^56^3^
facturafel_e^serie^0^20^1^
facturafel_e^num_doc^5^3840^2^
facturafel_e^tipod^0^2^3^
facturafel_e^fecha^7^4^4^
facturafel_e^fecha_em^0^35^5^
facturafel_e^fecha_anul^0^35^6^
facturafel_e^from^0^50^7^
facturafel_e^to^0^50^8^
facturafel_e^cc^0^50^9^
facturafel_e^formats^0^10^10^
facturafel_e^tipo_doc^0^12^11^
facturafel_e^estado_doc^0^20^12^
facturafel_e^ant_serie^13^20^13^
facturafel_e^ant_numdoc^5^3840^14^
facturafel_e^ant_fecemi^7^4^15^
facturafel_e^ant_resoluc^13^30^16^
facturafel_e^c_moneda^0^3^17^
facturafel_e^tipo_cambio^0^10^18^
facturafel_e^num_int^5^5120^19^
facturafel_e^nit_e^0^12^20^
facturafel_e^nombre_c^0^70^21^
facturafel_e^idioma_e^0^2^22^
facturafel_e^nombre_e^0^70^23^
facturafel_e^codigo_e^0^3^24^
facturafel_e^dispositivo_e^0^3^25^
facturafel_e^direccion_e^0^70^26^
facturafel_e^departamento_e^0^20^27^
facturafel_e^municipio_e^0^20^28^
facturafel_e^pais_e^0^2^29^
facturafel_e^codpos_e^5^1280^30^
facturafel_e^nit_r^0^20^31^
facturafel_e^es_cui^1^2^32^
facturafel_e^nombre_r^0^100^33^
facturafel_e^idioma_r^0^2^34^
facturafel_e^direccion_r^0^150^35^
facturafel_e^departamento_r^0^20^36^
facturafel_e^municipio_r^0^20^37^
facturafel_e^pais_r^0^2^38^
facturafel_e^codpos_r^5^1280^39^
facturafel_e^total_b^5^2562^40^
facturafel_e^total_d^5^2562^41^
facturafel_e^monto_d^5^2562^42^
facturafel_e^total_i^5^2562^43^
facturafel_e^ing_netosg^5^2562^44^
facturafel_e^total_iva1^5^2562^45^
facturafel_e^tipo1^0^10^46^
facturafel_e^base1^5^5125^47^
facturafel_e^tasa1^5^5125^48^
facturafel_e^monto1^5^5125^49^
facturafel_e^total_neto^5^5125^50^
facturafel_e^serie_e^0^20^51^
facturafel_e^numdoc_e^0^40^52^
facturafel_e^autorizacion^0^200^53^
facturafel_e^estatus^0^2^54^
facturafel_e^fac_id^262^4^55^
facturafel_e^p_descuento^5^2310^56^
facturafel_e^mto_descuento^5^3586^57^
facturafel_e^fel_msg^2^4^58^
facturafel_e^id_factura^2^4^59^
facturafel_e^total_en_letras^0^250^60^
facturafel_e^tipo_pago^0^2^61^
facturafel_e^num_oc^0^20^62^
facturafel_e^un_pago_de^5^3586^63^
facturafel_e^npagos^1^2^64^
facturafel_e^mto_pago^5^3586^65^
facturafel_e^dia_pago^1^2^66^
facturafel_e^fecha_pago^7^4^67^
facturafel_e^nom_firma^0^80^68^
facturafel_e^dpi_firma^0^20^69^
facturafel_e^vencod^0^15^70^
facturafel_e^num_interno^0^20^71^
facturafel_e^nota1^13^75^72^
facturafel_e^num_aut^0^20^73^
facturafel_e^fecha_re^0^15^74^
facturafel_e^rango_i^5^3072^75^
facturafel_e^rango_f^5^3072^76^
facturafel_e^info_reg^0^15^77^
facturafel_e^es_exportacion^1^2^78^
facturafel_e^incoterm^0^3^79^
facturafel_e^nomconcomprador^13^100^80^
facturafel_e^dirconcomprador^13^100^81^
facturafel_e^otrreferencia^13^32^82^
facturafel_e^paicom^13^15^83^
facturafel_e^es_exenta^1^2^84^
facturafel_e^ordcmp^0^20^85^
facturafel_e^sat_establecimiento^1^2^86^
facturafel_ed^fac_id^2^4^1^
facturafel_ed^serie^0^20^2^
facturafel_ed^num_doc^5^3840^3^
facturafel_ed^tipod^0^2^4^
facturafel_ed^fecha^7^4^5^
facturafel_ed^descrip_p^0^100^6^
facturafel_ed^codigo_p^0^14^7^
facturafel_ed^unidad_m^0^3^8^
facturafel_ed^cantidad^5^3074^9^
facturafel_ed^precio_u^5^5125^10^
facturafel_ed^precio_t^5^5125^11^
facturafel_ed^descto_t^5^5125^12^
facturafel_ed^descto_m^5^5125^13^
facturafel_ed^precio_p^5^5125^14^
facturafel_ed^precio_m^5^5125^15^
facturafel_ed^total_imp^5^5125^16^
facturafel_ed^ing_netos^5^5125^17^
facturafel_ed^total_iva^5^5125^18^
facturafel_ed^tipo^0^15^19^
facturafel_ed^base^5^5125^20^
facturafel_ed^tasa^5^2565^21^
facturafel_ed^monto^5^5125^22^
facturafel_ed^categoria^0^10^23^
facturafel_ed^txt_especial^0^1^24^
facturafel_ed^txt_largo^201^4096^25^
facturafel_ed^linea1^201^1000^26^
facturafel_ed^linea2^201^1000^27^
facturafel_fra^cod_frase^257^2^1^
facturafel_fra^nombre^13^255^2^
facturafel_fra^descripcion^201^2000^3^
facturafel_fra_e^cod_frase^257^2^1^
facturafel_fra_e^cod_escenario^257^2^2^
facturafel_fra_e^descripcion^201^2000^3^
facturafel_fra_e^nombre^13^255^4^
glb_categors^codcat^257^2^1^
glb_categors^nomcat^269^30^2^
glb_categors^userid^256^15^3^
glb_categors^fecsis^263^4^4^
glb_categors^horsis^266^1642^5^
glb_ciudades^ciudad^257^2^1^
glb_ciudades^codpai^257^2^2^
glb_ciudades^nomciu^269^40^3^
glb_ciudades^userid^269^15^4^
glb_ciudades^fecsis^263^4^5^
glb_ciudades^horsis^266^1642^6^
glb_delivery^coddlv^257^2^1^
glb_delivery^nomdlv^269^30^2^
glb_delivery^estado^257^2^3^
glb_delivery^userid^256^15^4^
glb_delivery^fecsis^263^4^5^
glb_delivery^horsis^266^1642^6^
glb_dprogram^lnkpro^262^4^1^
glb_dprogram^codpro^256^15^2^
glb_dprogram^progid^257^2^3^
glb_dprogram^codopc^13^15^4^
glb_dprogram^nomopc^13^40^5^
glb_dprogram^ordopc^1^2^6^
glb_dprogram^passwd^1^2^7^
glb_dprogram^userid^269^15^8^
glb_dprogram^fecsis^263^4^9^
glb_dprogram^horsis^266^1642^10^
glb_elabodrs^codela^257^2^1^
glb_elabodrs^nomela^269^30^2^
glb_elabodrs^estado^257^2^3^
glb_elabodrs^userid^256^15^4^
glb_elabodrs^fecsis^263^4^5^
glb_elabodrs^horsis^266^1642^6^
glb_empresas^codemp^257^2^1^
glb_empresas^nomemp^269^50^2^
glb_empresas^nomabr^269^12^3^
glb_empresas^numnit^269^15^4^
glb_empresas^numtel^13^15^5^
glb_empresas^diremp^269^100^6^
glb_empresas^userid^256^15^7^
glb_empresas^fecsis^263^4^8^
glb_empresas^horsis^266^1642^9^
glb_gruprovs^codgru^257^2^1^
glb_gruprovs^nomgru^269^30^2^
glb_gruprovs^afecmp^257^2^3^
glb_gruprovs^userid^269^15^4^
glb_gruprovs^fecsis^263^4^5^
glb_gruprovs^horsis^266^1642^6^
glb_mmodulos^codmod^257^2^1^
glb_mmodulos^nommod^256^40^2^
glb_mmodulos^numord^257^2^3^
glb_mmodulos^estado^257^2^4^
glb_mmodulos^userid^269^15^5^
glb_mmodulos^fecsis^263^4^6^
glb_mmodulos^horsis^266^1642^7^
glb_mtpaises^codpai^257^2^1^
glb_mtpaises^nompai^269^40^2^
glb_mtpaises^userid^269^15^3^
glb_mtpaises^fecsis^263^4^4^
glb_mtpaises^horsis^266^1642^5^
glb_paramtrs^numpar^258^4^1^
glb_paramtrs^tippar^258^4^2^
glb_paramtrs^nompar^13^60^3^
glb_paramtrs^valchr^269^255^4^
glb_paramtrs^userid^269^15^5^
glb_paramtrs^fecsis^263^4^6^
glb_paramtrs^horsis^266^1642^7^
glb_permxrol^lnkacc^262^4^1^
glb_permxrol^roleid^257^2^2^
glb_permxrol^lnkpro^258^4^3^
glb_permxrol^codpro^256^15^4^
glb_permxrol^progid^257^2^5^
glb_permxrol^userid^269^15^6^
glb_permxrol^fecsis^263^4^7^
glb_permxrol^horsis^266^1642^8^
glb_permxusr^lnkper^262^4^1^
glb_permxusr^roleid^257^2^2^
glb_permxusr^lnkpro^258^4^3^
glb_permxusr^userid^256^15^4^
glb_permxusr^codpro^256^15^5^
glb_permxusr^progid^257^2^6^
glb_permxusr^activo^257^2^7^
glb_permxusr^passwd^0^20^8^
glb_permxusr^fecini^7^4^9^
glb_permxusr^fecfin^7^4^10^
glb_permxusr^usuaid^256^15^11^
glb_permxusr^fecsis^263^4^12^
glb_permxusr^horsis^266^1642^13^
glb_pesotara^codtar^257^2^1^
glb_pesotara^destar^269^30^2^
glb_pesotara^canpes^261^1282^3^
glb_pesotara^userid^269^15^4^
glb_pesotara^fecsis^263^4^5^
glb_pesotara^horsis^266^1642^6^
glb_programs^codpro^256^15^1^
glb_programs^nompro^269^100^2^
glb_programs^dcrpro^13^100^3^
glb_programs^codmod^1^2^4^
glb_programs^ordpro^1^2^5^
glb_programs^actpro^13^30^6^
glb_programs^userid^256^15^7^
glb_programs^fecsis^263^4^8^
glb_programs^horsis^266^1642^9^
glb_rolesusr^roleid^258^4^1^
glb_rolesusr^nmrole^269^50^2^
glb_rolesusr^userid^269^15^3^
glb_rolesusr^fecsis^263^4^4^
glb_rolesusr^horsis^266^1642^5^
glb_subcateg^codcat^257^2^1^
glb_subcateg^subcat^257^2^2^
glb_subcateg^nomsub^269^50^3^
glb_subcateg^userid^256^15^4^
glb_subcateg^fecsis^263^4^5^
glb_subcateg^horsis^266^1642^6^
glb_sucsxemp^codsuc^257^2^1^
glb_sucsxemp^codemp^257^2^2^
glb_sucsxemp^nomsuc^269^50^3^
glb_sucsxemp^nomabr^269^16^4^
glb_sucsxemp^numnit^269^15^5^
glb_sucsxemp^numtel^13^15^6^
glb_sucsxemp^numfax^13^15^7^
glb_sucsxemp^dirsuc^269^100^8^
glb_sucsxemp^userid^256^15^9^
glb_sucsxemp^fecsis^7^4^10^
glb_sucsxemp^horsis^10^1642^11^
glb_userauth^codaut^257^2^1^
glb_userauth^nomaut^269^50^2^
glb_userauth^estado^257^2^3^
glb_userauth^userid^256^15^4^
glb_userauth^fecsis^263^4^5^
glb_userauth^horsis^266^1642^6^
glb_usuarios^userid^269^15^1^
glb_usuarios^nomusr^269^50^2^
glb_usuarios^email1^13^50^3^
glb_usuarios^tipusu^257^2^4^
glb_usuarios^roleid^257^2^5^
glb_usuarios^usuaid^269^15^6^
glb_usuarios^fecsis^263^4^7^
glb_usuarios^horsis^266^1642^8^
glb_usuarios^usupwd^13^40^9^
glb_vendedrs^codven^257^2^1^
glb_vendedrs^nomven^269^50^2^
glb_vendedrs^estado^257^2^3^
glb_vendedrs^haycom^257^2^4^
glb_vendedrs^userid^256^15^5^
glb_vendedrs^fecsis^263^4^6^
glb_vendedrs^horsis^266^1642^7^
grupo^grpid^262^4^1^
grupo^grpnombre^13^255^2^
inv_destipro^tipdes^257^2^1^
inv_destipro^nomdes^269^30^2^
inv_destipro^userid^256^15^3^
inv_destipro^fecsis^263^4^4^
inv_destipro^horsis^266^1642^5^
inv_dproduct^cditem^258^4^1^
inv_dproduct^citems^258^4^2^
inv_dproduct^codabr^269^20^3^
inv_dproduct^cantid^261^3592^4^
inv_dproduct^correl^257^2^5^
inv_dproduct^userid^269^15^6^
inv_dproduct^fecsis^263^4^7^
inv_dproduct^horsis^266^1642^8^
inv_dtransac^lnktra^258^4^1^
inv_dtransac^codemp^257^2^2^
inv_dtransac^codsuc^257^2^3^
inv_dtransac^codbod^257^2^4^
inv_dtransac^tipmov^257^2^5^
inv_dtransac^codori^258^4^6^
inv_dtransac^coddes^258^4^7^
inv_dtransac^fecemi^263^4^8^
inv_dtransac^aniotr^257^2^9^
inv_dtransac^mestra^257^2^10^
inv_dtransac^cditem^258^4^11^
inv_dtransac^codabr^269^20^12^
inv_dtransac^nserie^13^30^13^
inv_dtransac^codepq^257^2^14^
inv_dtransac^canepq^261^3586^15^
inv_dtransac^canuni^261^3586^16^
inv_dtransac^preuni^261^3590^17^
inv_dtransac^totpro^261^3586^18^
inv_dtransac^prepro^261^3586^19^
inv_dtransac^correl^257^2^20^
inv_dtransac^barcod^13^20^21^
inv_dtransac^tipope^257^2^22^
inv_dtransac^estado^256^1^23^
inv_dtransac^opeval^261^3586^24^
inv_dtransac^opeuni^261^3586^25^
inv_dtransac^actexi^257^2^26^
inv_dtransac^porisv^5^1282^27^
inv_dtransac^totisv^261^3074^28^
inv_dtransac^userid^269^15^29^
inv_dtransac^fecsis^263^4^30^
inv_dtransac^horsis^266^1642^31^
inv_empaques^codepq^257^2^1^
inv_empaques^nomepq^269^30^2^
inv_empaques^cantid^261^3078^3^
inv_empaques^unimed^257^2^4^
inv_empaques^userid^269^15^5^
inv_empaques^fecsis^263^4^6^
inv_empaques^horsis^266^1642^7^
inv_epqsxpro^lnkepq^262^4^1^
inv_epqsxpro^cditem^258^4^2^
inv_epqsxpro^codepq^257^2^3^
inv_epqsxpro^nomepq^269^40^4^
inv_epqsxpro^cantid^261^3078^5^
inv_epqsxpro^userid^269^15^6^
inv_epqsxpro^fecsis^263^4^7^
inv_epqsxpro^horsis^266^1642^8^
inv_grupomov^codgru^257^2^1^
inv_grupomov^nomgru^269^30^2^
inv_grupomov^tipope^257^2^3^
inv_grupomov^numord^257^2^4^
inv_grupomov^userid^269^15^5^
inv_grupomov^fecsis^263^4^6^
inv_grupomov^horsis^266^1642^7^
inv_marcapro^codmar^257^2^1^
inv_marcapro^nommar^269^50^2^
inv_marcapro^userid^256^15^3^
inv_marcapro^fecsis^263^4^4^
inv_marcapro^horsis^266^1642^5^
inv_mbodegas^codbod^257^2^1^
inv_mbodegas^codemp^257^2^2^
inv_mbodegas^codsuc^257^2^3^
inv_mbodegas^nombod^269^50^4^
inv_mbodegas^nomabr^13^12^5^
inv_mbodegas^chkexi^257^2^6^
inv_mbodegas^hayfac^257^2^7^
inv_mbodegas^userid^256^15^8^
inv_mbodegas^fecsis^263^4^9^
inv_mbodegas^horsis^266^1642^10^
inv_mtransac^lnktra^262^4^1^
inv_mtransac^codemp^257^2^2^
inv_mtransac^codsuc^257^2^3^
inv_mtransac^codbod^257^2^4^
inv_mtransac^tipmov^257^2^5^
inv_mtransac^codori^258^4^6^
inv_mtransac^nomori^13^50^7^
inv_mtransac^coddes^258^4^8^
inv_mtransac^nomdes^13^50^9^
inv_mtransac^numrf1^13^20^10^
inv_mtransac^numrf2^13^20^11^
inv_mtransac^numord^0^15^12^
inv_mtransac^aniotr^257^2^13^
inv_mtransac^mestra^257^2^14^
inv_mtransac^fecemi^263^4^15^
inv_mtransac^tipope^257^2^16^
inv_mtransac^observ^13^255^17^
inv_mtransac^estado^256^1^18^
inv_mtransac^lnkcon^2^4^19^
inv_mtransac^conaut^1^2^20^
inv_mtransac^motanl^13^100^21^
inv_mtransac^fecanl^7^4^22^
inv_mtransac^horanl^10^1642^23^
inv_mtransac^usranl^0^10^24^
inv_mtransac^impres^256^1^25^
inv_mtransac^userid^256^10^26^
inv_mtransac^fecsis^263^4^27^
inv_mtransac^horsis^266^1642^28^
inv_ncorretq^numcor^262^4^1^
inv_permxbod^codbod^257^2^1^
inv_permxbod^userid^256^15^2^
inv_permxbod^usuaid^256^15^3^
inv_permxbod^fecsis^263^4^4^
inv_permxbod^horsis^266^1642^5^
inv_permxtmv^tipmov^257^2^1^
inv_permxtmv^userid^256^15^2^
inv_permxtmv^usuaid^256^15^3^
inv_permxtmv^fecsis^263^4^4^
inv_permxtmv^horsis^266^1642^5^
inv_pesajpro^lnketq^262^4^1^
inv_pesajpro^numetq^269^20^2^
inv_pesajpro^cditem^258^4^3^
inv_pesajpro^codabr^256^20^4^
inv_pesajpro^fecpro^263^4^5^
inv_pesajpro^fecven^263^4^6^
inv_pesajpro^diavig^257^2^7^
inv_pesajpro^codtar^257^2^8^
inv_pesajpro^pbruto^261^3074^9^
inv_pesajpro^pstara^261^3074^10^
inv_pesajpro^canpes^261^3074^11^
inv_pesajpro^unipes^269^10^12^
inv_pesajpro^ixpeso^257^2^13^
inv_pesajpro^cxpeso^261^3586^14^
inv_pesajpro^canepq^261^3586^15^
inv_pesajpro^cditma^2^4^16^
inv_pesajpro^codaba^13^20^17^
inv_pesajpro^userid^269^15^18^
inv_pesajpro^fecsis^263^4^19^
inv_pesajpro^horsis^266^1642^20^
inv_products^cditem^262^4^1^
inv_products^codcat^257^2^2^
inv_products^subcat^257^2^3^
inv_products^codprv^258^4^4^
inv_products^codmar^257^2^5^
inv_products^unimed^257^2^6^
inv_products^dsitem^269^100^7^
inv_products^descto^257^2^8^
inv_products^rebaja^257^2^9^
inv_products^chkexi^257^2^10^
inv_products^codabr^269^20^11^
inv_products^diavig^257^2^12^
inv_products^tipdes^257^2^13^
inv_products^pesado^257^2^14^
inv_products^ixpeso^257^2^15^
inv_products^cxpeso^261^3586^16^
inv_products^canepq^261^3586^17^
inv_products^essubp^257^2^18^
inv_products^tipepq^257^2^19^
inv_products^premin^261^3074^20^
inv_products^presug^261^3074^21^
inv_products^prereb^261^3074^22^
inv_products^pulcom^261^3074^23^
inv_products^canva1^261^1794^24^
inv_products^canva2^261^1794^25^
inv_products^canva3^261^1794^26^
inv_products^preva1^261^3074^27^
inv_products^preva2^261^3074^28^
inv_products^preva3^261^3074^29^
inv_products^porisv^261^1282^30^
inv_products^estado^257^2^31^
inv_products^status^257^2^32^
inv_products^exiact^261^3074^33^
inv_products^fulcam^7^4^34^
inv_products^urlimg^13^100^35^
inv_products^despro^269^100^36^
inv_products^haypre^257^2^37^
inv_products^esserv^257^2^38^
inv_products^escomb^257^2^39^
inv_products^userid^256^15^40^
inv_products^fecsis^263^4^41^
inv_products^horsis^266^1642^42^
inv_proenbod^codemp^257^2^1^
inv_proenbod^codsuc^257^2^2^
inv_proenbod^codbod^257^2^3^
inv_proenbod^cditem^258^4^4^
inv_proenbod^codabr^269^20^5^
inv_proenbod^eximin^261^3586^6^
inv_proenbod^eximax^261^3586^7^
inv_proenbod^fulent^7^4^8^
inv_proenbod^fulsal^7^4^9^
inv_proenbod^exican^261^3586^10^
inv_proenbod^exival^261^3586^11^
inv_proenbod^cospro^261^3590^12^
inv_proenbod^userid^269^15^13^
inv_proenbod^fecsis^263^4^14^
inv_proenbod^horsis^266^1642^15^
inv_provedrs^codprv^258^4^1^
inv_provedrs^nomprv^269^100^2^
inv_provedrs^numnit^269^30^3^
inv_provedrs^numtel^13^30^4^
inv_provedrs^dirprv^269^100^5^
inv_provedrs^nomcon^13^50^6^
inv_provedrs^bemail^13^100^7^
inv_provedrs^tipprv^257^2^8^
inv_provedrs^observ^13^255^9^
inv_provedrs^userid^256^15^10^
inv_provedrs^fecsis^263^4^11^
inv_provedrs^horsis^266^1642^12^
inv_saldopro^lnksal^262^4^1^
inv_saldopro^codemp^257^2^2^
inv_saldopro^codsuc^257^2^3^
inv_saldopro^codbod^257^2^4^
inv_saldopro^tipsld^257^2^5^
inv_saldopro^aniotr^257^2^6^
inv_saldopro^mestra^257^2^7^
inv_saldopro^cditem^258^4^8^
inv_saldopro^codabr^269^20^9^
inv_saldopro^canuni^261^4098^10^
inv_saldopro^prepro^261^4102^11^
inv_saldopro^totpro^261^4098^12^
inv_saldopro^userid^256^10^13^
inv_saldopro^fecsis^263^4^14^
inv_saldopro^horsis^266^1642^15^
inv_scfisico^lnkreg^262^4^1^
inv_scfisico^codemp^257^2^2^
inv_scfisico^codsuc^257^2^3^
inv_scfisico^codbod^257^2^4^
inv_scfisico^aniotr^257^2^5^
inv_scfisico^mestra^257^2^6^
inv_scfisico^fecinv^263^4^7^
inv_scfisico^cditem^258^4^8^
inv_scfisico^codabr^269^20^9^
inv_scfisico^codepq^257^2^10^
inv_scfisico^canepq^261^4098^11^
inv_scfisico^canuni^261^4098^12^
inv_scfisico^canexi^261^4098^13^
inv_scfisico^finmes^257^2^14^
inv_scfisico^numrck^13^10^15^
inv_scfisico^nufico^13^10^16^
inv_scfisico^userid^269^15^17^
inv_scfisico^fecsis^263^4^18^
inv_scfisico^horsis^266^1642^19^
inv_tipomovs^tipmov^257^2^1^
inv_tipomovs^nommov^269^50^2^
inv_tipomovs^tipope^257^2^3^
inv_tipomovs^nomabr^256^6^4^
inv_tipomovs^hayval^257^2^5^
inv_tipomovs^hayres^257^2^6^
inv_tipomovs^coraut^1^2^7^
inv_tipomovs^codgru^1^2^8^
inv_tipomovs^userid^256^15^9^
inv_tipomovs^fecsis^263^4^10^
inv_tipomovs^horsis^266^1642^11^
inv_tofisico^codemp^257^2^1^
inv_tofisico^codsuc^257^2^2^
inv_tofisico^codbod^257^2^3^
inv_tofisico^aniotr^257^2^4^
inv_tofisico^mestra^257^2^5^
inv_tofisico^fecinv^263^4^6^
inv_tofisico^cditem^258^4^7^
inv_tofisico^codabr^269^20^8^
inv_tofisico^cancon^261^4098^9^
inv_tofisico^canepq^261^4098^10^
inv_tofisico^totepq^261^4098^11^
inv_tofisico^canhhd^261^4098^12^
inv_tofisico^cansue^261^4098^13^
inv_tofisico^canuni^261^4098^14^
inv_tofisico^totpro^261^4098^15^
inv_tofisico^canexi^261^4098^16^
inv_tofisico^finmes^257^2^17^
inv_tofisico^userid^256^10^18^
inv_tofisico^fecsis^263^4^19^
inv_tofisico^horsis^266^1642^20^
inv_unimedid^unimed^257^2^1^
inv_unimedid^nommed^269^50^2^
inv_unimedid^nomabr^256^4^3^
inv_unimedid^userid^256^15^4^
inv_unimedid^fecsis^263^4^5^
inv_unimedid^horsis^266^1642^6^
menu^menid^262^4^1^
menu^mennombre^13^255^2^
menu^mencmd^0^1000^3^
menu^mentipo^1^2^4^
menu^menpadre^2^4^5^
permiso^pergrpid^258^4^1^
permiso^permenid^258^4^2^
pla_empleads^codepl^258^4^1^
pla_empleads^nomemp^256^40^2^
pla_empleads^estado^257^2^3^
pla_empleads^userid^269^15^4^
pla_empleads^fecsis^263^4^5^
pla_empleads^horsis^266^1642^6^
pos_dtransac^lnktra^258^4^1^
pos_dtransac^codemp^257^2^2^
pos_dtransac^codsuc^257^2^3^
pos_dtransac^codbod^257^2^4^
pos_dtransac^lnkrec^258^4^5^
pos_dtransac^numrec^256^10^6^
pos_dtransac^cantid^257^2^7^
pos_dtransac^prevta^261^2306^8^
pos_dtransac^cospre^261^2306^9^
pos_dtransac^totrec^261^3586^10^
pos_dtransac^correl^257^2^11^
pos_dtransac^totisv^261^2306^12^
pos_dtransac^porisv^261^1282^13^
pos_dtransac^totdes^261^2306^14^
pos_dtransac^preori^261^2306^15^
pos_dtransac^tipdes^257^2^16^
pos_mtransac^lnktra^262^4^1^
pos_mtransac^numpos^257^2^2^
pos_mtransac^codemp^257^2^3^
pos_mtransac^lnktdc^258^4^4^
pos_mtransac^tipdoc^257^2^5^
pos_mtransac^nserie^256^10^6^
pos_mtransac^numdoc^258^4^7^
pos_mtransac^fecemi^263^4^8^
pos_mtransac^numesa^257^2^9^
pos_mtransac^codcli^258^4^10^
pos_mtransac^numnit^0^20^11^
pos_mtransac^nomcli^0^60^12^
pos_mtransac^moneda^257^2^13^
pos_mtransac^efecti^261^3586^14^
pos_mtransac^cheque^261^3586^15^
pos_mtransac^tarcre^261^3586^16^
pos_mtransac^totdoc^261^3586^17^
pos_mtransac^totpag^261^3586^18^
pos_mtransac^totisv^261^3586^19^
pos_mtransac^totgra^261^3586^20^
pos_mtransac^totexe^261^3586^21^
pos_mtransac^totdes^261^3586^22^
pos_mtransac^pordes^261^1282^23^
pos_mtransac^llevar^1^2^24^
pos_mtransac^descrp^0^200^25^
pos_mtransac^estado^257^2^26^
pos_mtransac^feccor^263^4^27^
pos_mtransac^haycor^257^2^28^
pos_mtransac^credit^257^2^29^
pos_mtransac^csmepl^257^2^30^
pos_mtransac^regali^257^2^31^
pos_mtransac^codepl^1^2^32^
pos_mtransac^usrope^269^15^33^
pos_mtransac^userid^269^15^34^
pos_mtransac^fecsis^263^4^35^
pos_mtransac^horsis^266^1642^36^
pos_mtransac^motanl^13^100^37^
pos_mtransac^usranl^13^15^38^
pos_mtransac^fecanl^7^4^39^
pos_mtransac^horanl^10^1642^40^
pos_mtransac^propin^261^1794^41^
pos_mtransac^porpro^261^1282^42^
pos_mtransac^totcta^261^3586^43^
pos_mtransac^lnkinv^2^4^44^
pos_mtransac^trazbd^1^2^45^
pos_mtransac^coddlv^1^2^46^
pos_mtransac^codela^1^2^47^
sre_divrecet^coddiv^257^2^1^
sre_divrecet^nomdiv^269^30^2^
sre_divrecet^codabr^0^1^3^
sre_divrecet^norden^257^2^4^
sre_divrecet^imagen^13^100^5^
sre_divrecet^enmenu^257^2^6^
sre_divrecet^estado^257^2^7^
sre_divrecet^userid^269^15^8^
sre_divrecet^fecsis^263^4^9^
sre_divrecet^horsis^266^1642^10^
sre_dordenes^lnkord^258^4^1^
sre_dordenes^lnkrec^258^4^2^
sre_dordenes^numrec^256^10^3^
sre_dordenes^cantid^257^2^4^
sre_dordenes^prevta^261^2306^5^
sre_dordenes^cospre^261^2306^6^
sre_dordenes^totrec^261^2306^7^
sre_dordenes^correl^257^2^8^
sre_dordenes^preori^261^2306^9^
sre_dordenes^totdes^261^2306^10^
sre_dordenes^tipdes^257^2^11^
sre_dplaspre^lnkord^258^4^1^
sre_dplaspre^lnkrec^258^4^2^
sre_dplaspre^numrec^256^10^3^
sre_dplaspre^cantid^257^2^4^
sre_dplaspre^correl^257^2^5^
sre_drecetas^lnkrec^258^4^1^
sre_drecetas^tingre^256^1^2^
sre_drecetas^cditem^258^4^3^
sre_drecetas^codabr^269^20^4^
sre_drecetas^unimed^258^4^5^
sre_drecetas^canuni^261^3590^6^
sre_drecetas^correl^257^2^7^
sre_drecetas^entrga^257^2^8^
sre_dsubrect^lnkrec^258^4^1^
sre_dsubrect^cditem^258^4^2^
sre_dsubrect^codabr^269^20^3^
sre_dsubrect^canuni^261^2306^4^
sre_dsubrect^correl^257^2^5^
sre_mordenes^lnkord^262^4^1^
sre_mordenes^numpos^257^2^2^
sre_mordenes^numesa^257^2^3^
sre_mordenes^numord^258^4^4^
sre_mordenes^fecemi^263^4^5^
sre_mordenes^totord^261^3586^6^
sre_mordenes^totdes^261^2306^7^
sre_mordenes^llevar^1^2^8^
sre_mordenes^observ^0^200^9^
sre_mordenes^estado^257^2^10^
sre_mordenes^status^257^2^11^
sre_mordenes^userid^269^15^12^
sre_mordenes^fecsis^263^4^13^
sre_mordenes^horsis^266^1642^14^
sre_mordenes^usranl^13^15^15^
sre_mordenes^fecanl^7^4^16^
sre_mordenes^horanl^10^1642^17^
sre_mordenes^lnktra^258^4^18^
sre_mordenes^numant^1^2^19^
sre_mordenes^feccam^7^4^20^
sre_mordenes^usrcam^13^15^21^
sre_mordenes^horcam^10^1642^22^
sre_mrecetas^lnkrec^262^4^1^
sre_mrecetas^numrec^256^10^2^
sre_mrecetas^coddiv^257^2^3^
sre_mrecetas^nomrec^269^50^4^
sre_mrecetas^cospre^261^2306^5^
sre_mrecetas^prevta^261^2306^6^
sre_mrecetas^porisv^261^1282^7^
sre_mrecetas^numpos^257^2^8^
sre_mrecetas^enmenu^257^2^9^
sre_mrecetas^imagen^13^100^10^
sre_mrecetas^combeb^257^2^11^
sre_mrecetas^bebref^257^2^12^
sre_mrecetas^receta^257^2^13^
sre_mrecetas^userid^269^15^14^
sre_mrecetas^fecsis^263^4^15^
sre_mrecetas^horsis^266^1642^16^
sre_subrecet^lnkrec^262^4^1^
sre_subrecet^numrec^256^10^2^
sre_subrecet^nomrec^269^50^3^
sre_subrecet^cospre^261^2306^4^
sre_subrecet^numpor^261^2306^5^
sre_subrecet^userid^269^15^6^
sre_subrecet^fecsis^263^4^7^
sre_subrecet^horsis^266^1642^8^
usuario^usuid^262^4^1^
usuario^usulogin^13^255^2^
usuario^usupwd^13^255^3^
usuario^usunombre^13^255^4^
usuario^usugrpid^2^4^5^
vis_consumosinvxi^numpos^257^2^1^
vis_consumosinvxi^fecemi^263^4^2^
vis_consumosinvxi^codcat^257^2^3^
vis_consumosinvxi^nomcat^269^30^4^
vis_consumosinvxi^cditem^262^4^5^
vis_consumosinvxi^codabr^269^20^6^
vis_consumosinvxi^dsitem^269^100^7^
vis_consumosinvxi^unimed^257^2^8^
vis_consumosinvxi^nommed^269^50^9^
vis_consumosinvxi^cantid^5^4870^10^
vis_detallelibroventas^numpos^257^2^1^
vis_detallelibroventas^nompos^269^40^2^
vis_detallelibroventas^tipdoc^257^2^3^
vis_detallelibroventas^nomdoc^269^40^4^
vis_detallelibroventas^lnktdc^258^4^5^
vis_detallelibroventas^nserie^256^10^6^
vis_detallelibroventas^fecemi^263^4^7^
vis_detallelibroventas^nomcli^0^60^8^
vis_detallelibroventas^numnit^0^20^9^
vis_detallelibroventas^numdoc^258^4^10^
vis_detallelibroventas^totgra^5^3586^11^
vis_detallelibroventas^totexe^5^3586^12^
vis_detallelibroventas^totisv^5^3586^13^
vis_detallelibroventas^totdoc^5^3586^14^
vis_estadiscorte^numpos^257^2^1^
vis_estadiscorte^codemp^257^2^2^
vis_estadiscorte^lnktdc^258^4^3^
vis_estadiscorte^nomdoc^269^40^4^
vis_estadiscorte^nserie^256^10^5^
vis_estadiscorte^numdoc^258^4^6^
vis_estadiscorte^fecemi^263^4^7^
vis_estadiscorte^feccor^263^4^8^
vis_estadiscorte^codcat^257^2^9^
vis_estadiscorte^nomcat^269^30^10^
vis_estadiscorte^cditem^258^4^11^
vis_estadiscorte^dsitem^269^100^12^
vis_estadiscorte^codabr^256^20^13^
vis_estadiscorte^cantid^261^3586^14^
vis_estadiscorte^preuni^261^3590^15^
vis_estadiscorte^totpro^261^3586^16^
vis_estadiscorte^totisv^2^4^17^
vis_estadiscorte^totdes^261^3074^18^
vis_estadisticaventas^numpos^257^2^1^
vis_estadisticaventas^codemp^257^2^2^
vis_estadisticaventas^nserie^256^10^3^
vis_estadisticaventas^numdoc^258^4^4^
vis_estadisticaventas^fecemi^263^4^5^
vis_estadisticaventas^feccor^263^4^6^
vis_estadisticaventas^codcat^257^2^7^
vis_estadisticaventas^nomcat^269^30^8^
vis_estadisticaventas^cditem^258^4^9^
vis_estadisticaventas^dsitem^269^100^10^
vis_estadisticaventas^codabr^256^20^11^
vis_estadisticaventas^cantid^261^3586^12^
vis_estadisticaventas^prevta^261^3590^13^
vis_estadisticaventas^totrec^261^3586^14^
vis_estadisticaventas^totisv^5^3074^15^
vis_estadisticaventas^totdes^261^3074^16^
vis_integramovtos^codemp^257^2^1^
vis_integramovtos^codsuc^257^2^2^
vis_integramovtos^codbod^257^2^3^
vis_integramovtos^nomemp^269^50^4^
vis_integramovtos^fecemi^263^4^5^
vis_integramovtos^codgru^1^2^6^
vis_integramovtos^nomgru^269^30^7^
vis_integramovtos^codcat^257^2^8^
vis_integramovtos^cditem^258^4^9^
vis_integramovtos^codabr^269^20^10^
vis_integramovtos^dsitem^269^100^11^
vis_integramovtos^nomuni^256^4^12^
vis_integramovtos^canuni^261^3586^13^
vis_libroventas^numpos^257^2^1^
vis_libroventas^nompos^269^40^2^
vis_libroventas^tipdoc^257^2^3^
vis_libroventas^nomdoc^269^40^4^
vis_libroventas^lnktdc^258^4^5^
vis_libroventas^nserie^256^10^6^
vis_libroventas^fecemi^263^4^7^
vis_libroventas^numdoc^258^4^8^
vis_libroventas^totgra^2^4^9^
vis_libroventas^totexe^5^8194^10^
vis_libroventas^totisv^2^4^11^
vis_libroventas^totdoc^5^8194^12^
vis_ordenescomida^numpos^257^2^1^
vis_ordenescomida^numesa^257^2^2^
vis_ordenescomida^lnkrec^258^4^3^
vis_ordenescomida^nomrec^269^50^4^
vis_ordenescomida^cantid^5^8192^5^
vis_ordenescomida^prevta^5^8447^6^
vis_ordenescomida^totrec^5^8194^7^
vis_ordenescomida^totdes^5^8194^8^
vis_productobodega^codemp^257^2^1^
vis_productobodega^nomemp^269^50^2^
vis_productobodega^codsuc^257^2^3^
vis_productobodega^nomsuc^269^50^4^
vis_productobodega^codbod^257^2^5^
vis_productobodega^nombod^269^50^6^
vis_productobodega^codcat^257^2^7^
vis_productobodega^nomcat^269^30^8^
vis_productobodega^cditem^258^4^9^
vis_productobodega^codabr^269^20^10^
vis_productobodega^dsitem^269^100^11^
vis_productobodega^nomuni^269^50^12^
vis_productos^cditem^262^4^1^
vis_productos^codabr^269^20^2^
vis_productos^dsitem^269^100^3^
vis_productos^presug^261^3074^4^
vis_programas^codmod^1^2^1^
vis_programas^codpro^13^15^2^
vis_programas^nompro^13^40^3^
vis_programas^parent^0^15^4^
vis_programas^progid^257^2^5^
vis_programas^lnkpro^262^4^6^
vis_programas^ordopc^1^2^7^
vis_reporterecetas^numrec^256^10^1^
vis_reporterecetas^nomrec^269^50^2^
vis_reporterecetas^coddiv^257^2^3^
vis_reporterecetas^nomdiv^269^30^4^
vis_reporterecetas^cospre^261^2306^5^
vis_reporterecetas^prevta^261^2306^6^
vis_reporterecetas^codabr^269^20^7^
vis_reporterecetas^dsitem^269^100^8^
vis_reporterecetas^unimed^257^2^9^
vis_reporterecetas^nommed^269^50^10^
vis_reporterecetas^canuni^261^3590^11^
vis_resumencortecaja^lnkcor^262^4^1^
vis_resumencortecaja^numpos^257^2^2^
vis_resumencortecaja^feccor^263^4^3^
vis_resumencortecaja^tipcor^257^2^4^
vis_resumencortecaja^observ^0^200^5^
vis_resumencortecaja^totvta^261^3074^6^
vis_resumencortecaja^fonini^261^3074^7^
vis_resumencortecaja^totgas^261^3074^8^
vis_resumencortecaja^totcor^261^3074^9^
vis_resumencortecaja^totefe^261^3074^10^
vis_resumencortecaja^tottar^261^3074^11^
vis_resumencortecaja^totcon^261^3074^12^
vis_resumencortecaja^totcre^261^3074^13^
vis_resumencortecaja^totcos^261^3074^14^
vis_resumencortecaja^totdon^261^3074^15^
vis_resumencortecaja^totisv^261^3074^16^
vis_resumencortecaja^totdes^261^4351^17^
vis_resumencortecaja^toecie^261^3074^18^
vis_resumencortecaja^toecor^261^3074^19^
vis_resumencortecaja^totdif^261^3074^20^
vis_resumencortecaja^ttacie^261^3074^21^
vis_resumencortecaja^todita^261^3074^22^
vis_resumencortecaja^userid^269^15^23^
vis_resumencortecaja^fecsis^263^4^24^
vis_resumencortecaja^horsis^266^1642^25^
vis_resumencortecaja^cierre^257^2^26^
vis_resumencortecaja^usrcie^13^15^27^
vis_resumencortecaja^feccie^7^4^28^
vis_resumencortecaja^horcie^10^1642^29^
vis_saldosxmovxmes^codemp^257^2^1^
vis_saldosxmovxmes^codsuc^257^2^2^
vis_saldosxmovxmes^codbod^257^2^3^
vis_saldosxmovxmes^aniotr^257^2^4^
vis_saldosxmovxmes^mestra^257^2^5^
vis_saldosxmovxmes^cditem^258^4^6^
vis_saldosxmovxmes^tipope^257^2^7^
vis_saldosxmovxmes^saluni^5^8194^8^
vis_saldosxmovxmes^salval^5^8194^9^
vis_tipdocxpos^lnktdc^262^4^1^
vis_tipdocxpos^numpos^257^2^2^
vis_tipdocxpos^hayimp^257^2^3^
vis_tipdocxpos^nomdoc^13^88^4^
vis_tipdocxpostodos^lnktdc^262^4^1^
vis_tipdocxpostodos^numpos^257^2^2^
vis_tipdocxpostodos^hayimp^257^2^3^
vis_tipdocxpostodos^nomdoc^13^88^4^
vis_ventasxhoras^numpos^257^2^1^
vis_ventasxhoras^feccor^263^4^2^
vis_ventasxhoras^horini^0^5^3^
vis_ventasxhoras^horfin^0^5^4^
vis_ventasxhoras^totdoc^261^3840^5^
vis_ventasxhoras^totvta^5^8194^6^
vta_presxcli^lnkpre^262^4^1^
vta_presxcli^codcli^258^4^2^
vta_presxcli^cditem^258^4^3^
vta_presxcli^codabr^13^20^4^
vta_presxcli^correl^257^2^5^
vta_presxcli^preuni^261^3078^6^
vta_presxcli^userid^269^15^7^
vta_presxcli^fecsis^263^4^8^
vta_presxcli^horsis^266^1642^9^
vta_preuxcan^lnkpre^262^4^1^
vta_preuxcan^cditem^258^4^2^
vta_preuxcan^codabr^13^20^3^
vta_preuxcan^correl^257^2^4^
vta_preuxcan^canini^261^3586^5^
vta_preuxcan^canfin^261^3586^6^
vta_preuxcan^preuni^261^3078^7^
vta_preuxcan^userid^269^15^8^
vta_preuxcan^fecsis^263^4^9^
vta_preuxcan^horsis^266^1642^10^
