agencias_bco^city_num^258^4^1^
agencias_bco^numage^258^4^2^
agencias_bco^nombre^269^40^3^
agencias_bco^nomlug^269^40^4^
andevarlog^andesesid^256^25^1^
andevarlog^parnombre^13^25^2^
andevarlog^parvalor^13^50^3^
andevarlog^fecha^7^4^4^
asistentes_nt^codasn^257^2^1^
asistentes_nt^nombre^269^40^2^
asistentes_rp^codarp^257^2^1^
asistentes_rp^nombre^269^40^2^
city^city_num^258^4^1^
city^city_name^269^30^2^
city^city_country^269^30^3^
city^city_cuenta^0^20^4^
city^city_telefono^0^20^5^
city^city_region^0^3^6^
city^city_gerente^13^80^7^
city^city_coordinador^13^100^8^
commemp^id_commemp^262^4^1^
commemp^nombre^269^255^2^
commemp^nit^13^15^3^
commemp^telefono^13^20^4^
commemp^direccion^13^100^5^
commemp^imagen^13^100^6^
commemp^estado^2^4^7^
commemp^dbname^13^8^8^
commemp^espropia^45^1^9^
commemp^cajasprestamosaldo^1^2^10^
commemp^codigo^13^5^11^
commemp^iniciales^13^8^12^
contact^contact_num^258^4^1^
contact^contact_cod_region^2^4^2^
contact^contact_city^258^4^3^
contact^contact_estado_caso^0^18^4^
contact^contact_operacion^256^20^5^
contact^contact_producto^13^18^6^
contact^contact_garantia^13^40^7^
contact^contact_estado_op^13^20^8^
contact^contact_dpi_cliente^13^20^9^
contact^contact_name^269^100^10^
contact^contact_street^13^240^11^
contact^contact_tel_cliente^13^240^12^
contact^contact_tel_casa^13^10^13^
contact^contact_tel_cel^13^10^14^
contact^contact_tel_trab^13^10^15^
contact^contact_tel_otro^13^10^16^
contact^contact_saldo_cap^13^20^17^
contact^contact_cap_vencido^13^20^18^
contact^contact_int_vencido^13^20^19^
contact^contact_saldo_imo^13^20^20^
contact^contact_otros^13^20^21^
contact^contact_total^13^20^22^
contact^contact_porc_serv^13^20^23^
contact^contact_total_cobrar^13^20^24^
contact^contact_fec_ult_pago^13^20^25^
contact^contact_cuotas_mora^13^20^26^
contact^contact_fec_mora^13^20^27^
contact^contact_nom_fia1^13^240^28^
contact^contact_dir_fia1^13^240^29^
contact^contact_nom_fia2^13^240^30^
contact^contact_dir_fia2^13^240^31^
contact^contact_nom_fia3^13^240^32^
contact^contact_dir_fia3^13^240^33^
contact^contact_rec_muser^269^20^34^
contact^contact_rec_mtime^266^4365^35^
contact^contact_rec_mstat^256^2^36^
contact^contact_when^10^4365^37^
contact^contact_valid^256^1^38^
contact^contact_num_m^13^40^39^
contact^contact_num_w^13^40^40^
contact^contact_num_h^13^40^41^
contact^contact_user^269^20^42^
contact^contact_loc_lon^5^2566^43^
contact^contact_loc_lat^5^2566^44^
contact^contact_photo_mtime^10^4365^45^
contact^contact_photo^11^56^46^
contact_seq^seqserial8^274^10^1^
contliquidacion^liq_fecha^266^3594^1^
contliquidacion^liq_user^269^20^2^
contliquidacion^liq_fec_ini^7^4^3^
contliquidacion^liq_fec_fin^7^4^4^
contnote^contnote_num^258^4^1^
contnote^contnote_rec_muser^269^20^2^
contnote^contnote_rec_mtime^266^4365^3^
contnote^contnote_rec_mstat^256^2^4^
contnote^contnote_contact^258^4^5^
contnote^contnote_when^266^4365^6^
contnote^contnote_text^0^1000^7^
contnote^contnote_cod_tipologia^0^2^8^
contnote^contnote_fecha_promesa^7^4^9^
contnote^contnote_monto_promesa^5^3845^10^
contnote^contnote_estado^0^1^11^
contnote^contnote_boleta_numero^13^25^12^
contnote^contnote_boleta_fecha^7^4^13^
contnote^contnote_boleta_monto^5^3845^14^
contnote^contnote_cuenta^13^25^15^
contnote^contnote_justificacion^13^200^16^
contnote^contnote_boleta_copia^0^1^17^
contnote_seq^seqserial8^274^10^1^
contnotedocs^contnote_num^258^4^1^
contnotedocs^contact_num^2^4^2^
contnotedocs^contdocs_id^258^4^3^
contnotedocs^contdocs_tipo^0^1^4^
contnotedocs^contdocs_desc^13^255^5^
contnotedocs^contdocs_doc^11^56^6^
contnotedocs^contdocs_name^13^100^7^
contphone^contphone_num^258^4^1^
contphone^contphone_phone^13^10^2^
contphone^contact_num^258^4^3^
cpj_config^tipo^269^25^1^
cpj_config^descripcion^269^255^2^
cpj_config^valor^269^25^3^
cpj_config^id_config^262^4^4^
datafilter^user_id^269^20^1^
datafilter^table_name^269^50^2^
datafilter^last_mtime^266^4365^3^
datafilter^temp_mtime^10^4365^4^
datafilter^where_part^13^250^5^
etapas_not^numeta^257^2^1^
etapas_not^nometa^269^50^2^
fases_not^nofase^257^2^1^
fases_not^nomfas^269^50^2^
glb_paramtrs^numpar^258^4^1^
glb_paramtrs^tippar^258^4^2^
glb_paramtrs^nompar^13^60^3^
glb_paramtrs^valchr^269^255^4^
glb_paramtrs^userid^269^15^5^
glb_paramtrs^fecsis^263^4^6^
glb_paramtrs^horsis^266^1642^7^
glb_permxusr^codpro^256^20^1^
glb_permxusr^progid^257^2^2^
glb_permxusr^userid^256^15^3^
glb_permxusr^activo^257^2^4^
glb_permxusr^passwd^0^20^5^
glb_permxusr^fecini^7^4^6^
glb_permxusr^fecfin^7^4^7^
glb_permxusr^usuaid^256^15^8^
glb_permxusr^fecsis^263^4^9^
glb_permxusr^horsis^266^1642^10^
glb_programs^codpro^256^15^1^
glb_programs^nompro^269^100^2^
glb_programs^dcrpro^269^100^3^
glb_programs^ordpro^257^2^4^
glb_programs^actpro^13^50^5^
glb_programs^userid^256^15^6^
glb_programs^fecsis^263^4^7^
glb_programs^horsis^266^1642^8^
grupo^grpid^262^4^1^
grupo^grpnombre^13^255^2^
grupostiposdoc^codgru^257^2^1^
grupostiposdoc^nombre^269^100^2^
grupostiposdoc_cob^codgru^257^2^1^
grupostiposdoc_cob^tipval^257^2^2^
grupostiposdoc_cob^tipcob^257^2^3^
grupostiposdoc_cob^rangos^257^2^4^
grupostiposdoc_cob^valfij^257^2^5^
grupostiposdoc_cob^valcob^261^2562^6^
grupostiposdoc_cob^porcen^261^2310^7^
grupostiposdoc_cob^valmax^261^2562^8^
grupostiposdoc_cob^ingcan^257^2^9^
grupostiposdoc_cob^sumsub^257^2^10^
grupostiposdoc_cob^mulcx1^257^2^11^
grupostiposdoc_cob^caliva^257^2^12^
grupostiposdoc_cob^valsum^257^2^13^
grupostiposdoc_cob^valres^257^2^14^
grupostiposdoc_cob^numcor^257^2^15^
grupostiposdoc_det^codgru^257^2^1^
grupostiposdoc_det^tipdoc^257^2^2^
grupostiposdoc_det^numcor^257^2^3^
grupostiposdoc_fas^codgru^257^2^1^
grupostiposdoc_fas^nofase^257^2^2^
grupostiposdoc_fas^diamin^257^2^3^
grupostiposdoc_fas^diarea^257^2^4^
grupostiposdoc_fas^diamax^257^2^5^
grupostiposdoc_fas^numcor^257^2^6^
grupostiposdoc_ran^codgru^257^2^1^
grupostiposdoc_ran^tipval^257^2^2^
grupostiposdoc_ran^tipcob^257^2^3^
grupostiposdoc_ran^valini^261^2562^4^
grupostiposdoc_ran^valfin^261^2562^5^
grupostiposdoc_ran^valran^261^2562^6^
grupostiposdoc_ran^porran^261^2310^7^
grupostiposdoc_ran^valres^261^2562^8^
grupostiposdoc_ran^numcor^257^2^9^
lugarenvio_not^lugenv^257^2^1^
lugarenvio_not^nomlug^269^40^2^
menu^menid^262^4^1^
menu^mennombre^13^255^2^
menu^mencmd^0^1000^3^
menu^mentipo^1^2^4^
menu^menpadre^2^4^5^
notariado^numexp^262^4^1^
notariado^codpro^1^2^2^
notariado^numcre^13^30^3^
notariado^tipdoc^257^2^4^
notariado^city_num^257^2^5^
notariado^numres^13^100^6^
notariado^fecres^7^4^7^
notariado^numage^258^4^8^
notariado^codasn^1^2^9^
notariado^fecasi^7^4^10^
notariado^nomcli^13^100^11^
notariado^valcre^5^2562^12^
notariado^codabo^1^2^13^
notariado^numesc^13^20^14^
notariado^fecesc^7^4^15^
notariado^hojini^2^4^16^
notariado^hojfin^2^4^17^
notariado^hojin2^2^4^18^
notariado^hojfi2^2^4^19^
notariado^todipt^2^4^20^
notariado^todies^1^2^21^
notariado^usrini^13^20^22^
notariado^fecini^7^4^23^
notariado^horini^10^1128^24^
notariado^usresc^13^20^25^
notariado^feesct^7^4^26^
notariado^horesc^10^1128^27^
notariado^nofase^1^2^28^
notariado^estado^1^2^29^
notariado^vhonor^5^2306^30^
notariado^valiva^5^2306^31^
notariado^vtinot^5^2306^32^
notariado^vprtes^5^2306^33^
notariado^vteses^5^2306^34^
notariado^vivacv^5^2306^35^
notariado^vhobas^5^2306^36^
notariado^lugfin^1^2^37^
notariado^vinfin^5^2306^38^
notariado^vhoexd^5^2306^39^
notariado^vrehoe^5^2306^40^
notariado^cfirgp^5^2306^41^
notariado^vfiext^5^2306^42^
notariado^vgadgp^5^2306^43^
notariado^vgrmun^5^2306^44^
notariado^vdifmg^5^2306^45^
notariado^vtcoba^5^2306^46^
notariado^ccoele^1^2^47^
notariado^vcoele^5^2306^48^
notariado^vgacer^5^2306^49^
notariado^vhopro^5^2306^50^
notariado^vdocex^5^2306^51^
notariado^vtocob^5^2306^52^
notariado^usrdsg^13^20^53^
notariado^fecdsg^7^4^54^
notariado^hordsg^10^1128^55^
notariado^fevfir^7^4^56^
notariado^frefir^7^4^57^
notariado^tdifir^1^2^58^
notariado^finrpg^7^4^59^
notariado^fegrpg^7^4^60^
notariado^nrerpg^13^20^61^
notariado^ndbrpg^13^20^62^
notariado^toparp^5^2306^63^
notariado^topaco^5^2306^64^
notariado^codrgo^1^2^65^
notariado^codarp^1^2^66^
notariado^todifo^1^2^67^
notariado^usrfor^13^20^68^
notariado^fecfor^7^4^69^
notariado^horfor^10^1128^70^
notariado^canrch^1^2^71^
notariado^totrch^5^2306^72^
notariado^ferech^7^4^73^
notariado^fecrei^7^4^74^
notariado^nrecrg^13^20^75^
notariado^ndocrg^13^20^76^
notariado^fecdev^7^4^77^
notariado^todidv^1^2^78^
notariado^todich^1^2^79^
notariado^usrrch^13^20^80^
notariado^fecrch^7^4^81^
notariado^horrch^10^1128^82^
notariado^totpag^5^2306^83^
notariado^numbol^13^20^84^
notariado^fecbol^7^4^85^
notariado^numdep^13^100^86^
notariado^usrdap^13^20^87^
notariado^fecdap^7^4^88^
notariado^hordap^10^1128^89^
notariado^fecdeb^7^4^90^
notariado^nuboho^13^20^91^
notariado^modeho^5^2306^92^
notariado^nuboga^13^20^93^
notariado^modega^5^2306^94^
notariado^nufade^13^30^95^
notariado^usrest^13^20^96^
notariado^fecest^7^4^97^
notariado^horest^10^1128^98^
notariado^lugenv^1^2^99^
notariado^fecenv^7^4^100^
notariado^fecrep^7^4^101^
notariado^nucoev^13^20^102^
notariado^todiev^1^2^103^
notariado^diapro^1^2^104^
notariado^usrpcl^13^20^105^
notariado^fecpcl^7^4^106^
notariado^horpcl^10^1128^107^
notariado^numeta^1^2^108^
notariado^fpagas^7^4^109^
notariado^mpagno^1^2^110^
notariado^observ^0^1200^111^
notariado^coment^0^1200^112^
notariado^usrdfi^13^20^113^
notariado^fecdfi^7^4^114^
notariado^hordfi^10^1642^115^
notariado^codgru^1^2^116^
notariado_cob^numexp^258^4^1^
notariado_cob^tipcob^257^2^2^
notariado_cob^nomcob^256^50^3^
notariado_cob^ingcan^257^2^4^
notariado_cob^sumsub^257^2^5^
notariado_cob^mulcx1^257^2^6^
notariado_cob^caliva^257^2^7^
notariado_cob^valsum^257^2^8^
notariado_cob^valres^257^2^9^
notariado_cob^cancob^257^2^10^
notariado_cob^valcob^261^2306^11^
notariado_cob^totcob^261^2306^12^
notariado_cob^numcor^257^2^13^
permiso^pergrpid^258^4^1^
permiso^permenid^258^4^2^
programas_not^codpro^257^2^1^
programas_not^nombre^269^40^2^
region^region_num^0^3^1^
region^region_nombre^13^80^2^
regiones^codreg^258^4^1^
regiones^nombre^13^63^2^
registros_ope^codrgo^257^2^1^
registros_ope^nombre^269^40^2^
tipologia^cod_tipologia^256^2^1^
tipologia^des_tipologia^13^60^2^
tipologia^estado^0^1^3^
tipologia^orden^1^2^4^
tiposcobro^tipcob^257^2^1^
tiposcobro^nomcob^269^50^2^
tiposcobro^norden^257^2^3^
tiposdocumento^tipdoc^257^2^1^
tiposdocumento^nombre^269^100^2^
uno^cod^1^2^1^
uno^des^0^1000^2^
uno^fecha^7^4^3^
users^user_id^269^20^1^
users^user_auth^13^200^2^
users^user_name^269^100^3^
users^user_status^257^2^4^
users^usuid^258^4^5^
users^usugrpid^2^4^6^
users^city_num^2^4^7^
users^city_num_alt^2^4^8^
users^user_mod_cobro^0^1^9^
users^user_mod_cobro_adm^0^1^10^
users^user_mod_cobro_lic^0^1^11^
users^user_mod_notar^0^1^12^
usuario^usuid^262^4^1^
usuario^usulogin^13^255^2^
usuario^usupwd^13^255^3^
usuario^usunombre^13^255^4^
usuario^usugrpid^2^4^5^
