city^city_num^258^4^1^
city^city_name^269^30^2^
city^city_country^269^30^3^
contact^contact_num^258^4^1^
contact^contact_rec_muser^269^20^2^
contact^contact_rec_mtime^266^4365^3^
contact^contact_rec_mstat^256^2^4^
contact^contact_name^269^100^5^
contact^contact_valid^256^1^6^
contact^contact_street^13^100^7^
contact^contact_city^258^4^8^
contact^contact_num_m^13^40^9^
contact^contact_num_w^13^40^10^
contact^contact_num_h^13^40^11^
contact^contact_user^269^20^12^
contact^contact_loc_lon^5^2566^13^
contact^contact_loc_lat^5^2566^14^
contact^contact_photo_mtime^10^4365^15^
contact^contact_photo^11^56^16^
contact^contact_cod_region^2^4^17^
contact_seq^seqserial8^274^10^1^
contnote^contnote_num^258^4^1^
contnote^contnote_rec_muser^269^20^2^
contnote^contnote_rec_mtime^266^4365^3^
contnote^contnote_rec_mstat^256^2^4^
contnote^contnote_contact^258^4^5^
contnote^contnote_when^266^4365^6^
contnote^contnote_text^13^250^7^
contnote_seq^seqserial8^274^10^1^
datafilter^user_id^269^20^1^
datafilter^table_name^269^50^2^
datafilter^last_mtime^266^4365^3^
datafilter^temp_mtime^10^4365^4^
datafilter^where_part^13^250^5^
users^user_id^269^20^1^
users^user_auth^13^200^2^
users^user_name^269^100^3^
users^user_status^257^2^4^
