<?xml version="1.0" encoding="UTF-8" standalone="no"?>
<!-- Created with Inkscape (http://www.inkscape.org/) -->

<svg
   xmlns:dc="http://purl.org/dc/elements/1.1/"
   xmlns:cc="http://creativecommons.org/ns#"
   xmlns:rdf="http://www.w3.org/1999/02/22-rdf-syntax-ns#"
   xmlns:svg="http://www.w3.org/2000/svg"
   xmlns="http://www.w3.org/2000/svg"
   xmlns:sodipodi="http://sodipodi.sourceforge.net/DTD/sodipodi-0.dtd"
   xmlns:inkscape="http://www.inkscape.org/namespaces/inkscape"
   width="70.67244mm"
   height="70.727127mm"
   viewBox="0 0 70.67244 70.727127"
   version="1.1"
   id="svg8"
   inkscape:version="0.92.2 (5c3e80d, 2017-08-06)"
   sodipodi:docname="kabaret_logo.svg">
  <defs
     id="defs2">
    <clipPath
       clipPathUnits="userSpaceOnUse"
       id="clipPath4661">
      <rect
         style="opacity:1;fill:#ff0000;fill-opacity:1;stroke:none;stroke-width:0.17390862;stroke-miterlimit:4;stroke-dasharray:none;stroke-opacity:1"
         id="rect4663"
         width="50.974571"
         height="43.357388"
         x="106.92934"
         y="37.874908" />
    </clipPath>
    <clipPath
       clipPathUnits="userSpaceOnUse"
       id="clipPath4661-9">
      <rect
         style="opacity:1;fill:#ff0000;fill-opacity:1;stroke:none;stroke-width:0.17390862;stroke-miterlimit:4;stroke-dasharray:none;stroke-opacity:1"
         id="rect4663-9"
         width="50.974571"
         height="43.357388"
         x="106.92934"
         y="37.874908" />
    </clipPath>
  </defs>
  <sodipodi:namedview
     id="base"
     pagecolor="#ffffff"
     bordercolor="#666666"
     borderopacity="1.0"
     inkscape:pageopacity="0.0"
     inkscape:pageshadow="2"
     inkscape:zoom="0.70710678"
     inkscape:cx="-225.76178"
     inkscape:cy="-112.90684"
     inkscape:document-units="mm"
     inkscape:current-layer="layer1"
     showgrid="false"
     inkscape:window-width="1791"
     inkscape:window-height="1626"
     inkscape:window-x="2010"
     inkscape:window-y="189"
     inkscape:window-maximized="0" />
  <metadata
     id="metadata5">
    <rdf:RDF>
      <cc:Work
         rdf:about="">
        <dc:format>image/svg+xml</dc:format>
        <dc:type
           rdf:resource="http://purl.org/dc/dcmitype/StillImage" />
        <dc:title></dc:title>
      </cc:Work>
    </rdf:RDF>
  </metadata>
  <g
     inkscape:label="Calque 1"
     inkscape:groupmode="layer"
     id="layer1"
     transform="translate(0,-226.27287)">
    <rect
       style="opacity:1;fill:#9c1e21;fill-opacity:1;stroke:none;stroke-width:0.1;stroke-miterlimit:4;stroke-dasharray:none;stroke-opacity:1"
       id="rect4522-1"
       width="8"
       height="50"
       x="24.851122"
       y="236.76073" />
    <rect
       style="opacity:1;fill:#9c1e21;fill-opacity:1;stroke:none;stroke-width:0.1;stroke-miterlimit:4;stroke-dasharray:none;stroke-opacity:1"
       id="rect4522-1-5-0"
       width="8"
       height="50"
       x="-185.01071"
       y="185.01071"
       transform="rotate(-45)" />
    <rect
       style="opacity:1;fill:#9c1e21;fill-opacity:1;stroke:none;stroke-width:0.1;stroke-miterlimit:4;stroke-dasharray:none;stroke-opacity:1"
       id="rect4522-1-6"
       width="8"
       height="50"
       x="-265.78735"
       y="10.289879"
       transform="rotate(-90)" />
    <rect
       style="opacity:1;fill:#9c1e21;fill-opacity:1;stroke:none;stroke-width:0.1;stroke-miterlimit:4;stroke-dasharray:none;stroke-opacity:1"
       id="rect4522-1-5"
       width="8"
       height="50"
       x="-143.02612"
       y="184.97205"
       transform="rotate(-45)" />
    <rect
       style="opacity:1;fill:#9c1e21;fill-opacity:1;stroke:none;stroke-width:0.1;stroke-miterlimit:4;stroke-dasharray:none;stroke-opacity:1"
       id="rect4522-1-1"
       width="8"
       height="50"
       x="185.01071"
       y="135.01071"
       transform="rotate(45)" />
    <rect
       style="opacity:1;fill:#9c1e21;fill-opacity:1;stroke:none;stroke-width:0.1;stroke-miterlimit:4;stroke-dasharray:none;stroke-opacity:1"
       id="rect4522-1-1-2"
       width="8"
       height="50"
       x="226.97205"
       y="135.02612"
       transform="rotate(45)"
       inkscape:transform-center-x="-63.877976"
       inkscape:transform-center-y="-22.678571" />
    <rect
       style="opacity:1;fill:#9c1e21;fill-opacity:1;stroke:none;stroke-width:0.1;stroke-miterlimit:4;stroke-dasharray:none;stroke-opacity:1"
       id="rect4522-1-1-25"
       width="8"
       height="50"
       x="124.56174"
       y="20.242504"
       transform="rotate(45,-156.29324,45.630271)"
       clip-path="url(#clipPath4661)" />
    <path
       transform="rotate(135,39.092461,143.63741)"
       style="opacity:1;fill:#9c1e21;fill-opacity:1;stroke:none;stroke-width:0.1;stroke-miterlimit:4;stroke-dasharray:none;stroke-opacity:1"
       clip-path="url(#clipPath4661-9)"
       d="m 124.56174,20.242504 h 8 v 50 h -8 z"
       id="rect4522-1-1-25-6"
       inkscape:connector-curvature="0" />
  </g>
</svg>
