{
  "project_info": {
    "project_number": "544015293888",
    "project_id": "appturismo-g1-7e768",
    "storage_bucket": "appturismo-g1-7e768.appspot.com"
  },
  "client": [
    {
      "client_info": {
        "mobilesdk_app_id": "1:544015293888:android:74bc7db0e5fabb6dae3c25",
        "android_client_info": {
          "package_name": "com.andresggiraldo.misiontic.appturismo"
        }
      },
      "oauth_client": [
        {
          "client_id": "544015293888-57psn6epotumjvmlsgn9stlc70i4ngq1.apps.googleusercontent.com",
          "client_type": 3
        }
      ],
      "api_key": [
        {
          "current_key": "AIzaSyDtaG3MvLkw8n7AzUSh4tdcpD_ElsY6U2A"
        }
      ],
      "services": {
        "appinvite_service": {
          "other_platform_oauth_client": [
            {
              "client_id": "544015293888-57psn6epotumjvmlsgn9stlc70i4ngq1.apps.googleusercontent.com",
              "client_type": 3
            }
          ]
        }
      }
    }
  ],
  "configuration_version": "1"
}