Average delivery time per traffic flow [ms]
13.030819 13.030101 12.072029 12.076814 9.164953 9.101680 8.265907 8.261817 7.391007 7.453475 
Average delivery time [ms]
9.984860
Jitter per traffic flow [ms]
0.027197 0.013625 0.011669 0.002924 0.124170 0.000969 0.000347 0.000347 0.000069 0.000037 
Average jitter [ms]
0.018135
Aggregated throughput per satellite channel [Mbps]
10.311488 10.311432 0.000000 0.000000 0.000000 0.000000 0.000000 0.000000 0.000000 0.000000 
Average aggregated throughput [Mbps]
2.062292
Cell occupancy per satellite per carrier
100 100 0 0 0 0 0 0 0 0 
100 100 0 0 0 0 0 0 0 0 
100 100 0 0 0 0 0 0 0 0 
100 100 0 0 0 0 0 0 0 0 
100 100 0 0 0 0 0 0 0 0 
Cell occupancy per satellite
500 500 0 0 0 0 0 0 0 0 
Number of handovers
10