{
	"info": {
		"_postman_id": "0ebf5182-c500-455a-b7e5-29530e04ca27",
		"name": "Query InfluxDB",
		"schema": "https://schema.getpostman.com/json/collection/v2.1.0/collection.json",
		"_exporter_id": "19348101"
	},
	"item": [
		{
			"name": "Query RanSim data in InfluxDBv2",
			"item": [
				{
					"name": "Query gnb_positioning measurement in InfluxDBv2",
					"event": [
						{
							"listen": "test",
							"script": {
								"exec": [
									"// test correctness of the response",
									"pm.test(",
									"    \"Status code is 200\", function () {",
									"        pm.response.to.have.status(200);",
									"    });",
									"// pull the response",
									"var csvData = pm.response.text();",
									"// the Postman console is retrievable at the bottom left corner of the application",
									"console.log(csvData)"
								],
								"type": "text/javascript"
							}
						}
					],
					"request": {
						"auth": {
							"type": "apikey",
							"apikey": [
								{
									"key": "value",
									"value": "Token monitoringToken",
									"type": "string"
								},
								{
									"key": "key",
									"value": "Authorization",
									"type": "string"
								}
							]
						},
						"method": "POST",
						"header": [
							{
								"key": "Content-Type",
								"value": "application/json",
								"type": "text"
							},
							{
								"key": "",
								"value": "",
								"type": "text",
								"disabled": true
							}
						],
						"body": {
							"mode": "raw",
							"raw": "{\n    \"query\":  \"from(bucket: \\\"monitoring\\\") |> range(start: -30d) |> filter(fn: (r) => r[\\\"_measurement\\\"] == \\\"ransim_gnb_positioning\\\") |> yield()\",\n    \"type\": \"flux\"\n}\n"
						},
						"url": {
							"raw": "http://{{InfluxDB_ip}}:{{InfluxDB_port}}/api/v2/query?org=nextworks",
							"protocol": "http",
							"host": [
								"{{InfluxDB_ip}}"
							],
							"port": "{{InfluxDB_port}}",
							"path": [
								"api",
								"v2",
								"query"
							],
							"query": [
								{
									"key": "org",
									"value": "nextworks"
								}
							]
						}
					},
					"response": []
				},
				{
					"name": "Query ue_positioning measurement in InfluxDBv2",
					"event": [
						{
							"listen": "test",
							"script": {
								"exec": [
									"// test correctness of the response",
									"pm.test(",
									"    \"Status code is 200\", function () {",
									"        pm.response.to.have.status(200);",
									"    });",
									"// pull the response",
									"var csvData = pm.response.text();",
									"// the Postman console is retrievable at the bottom left corner of the application",
									"console.log(csvData)"
								],
								"type": "text/javascript"
							}
						}
					],
					"request": {
						"auth": {
							"type": "apikey",
							"apikey": [
								{
									"key": "value",
									"value": "Token monitoringToken",
									"type": "string"
								},
								{
									"key": "key",
									"value": "Authorization",
									"type": "string"
								}
							]
						},
						"method": "POST",
						"header": [
							{
								"key": "Content-Type",
								"value": "application/json",
								"type": "text"
							},
							{
								"key": "",
								"value": "",
								"type": "text",
								"disabled": true
							}
						],
						"body": {
							"mode": "raw",
							"raw": "{\n    \"query\":  \"from(bucket: \\\"monitoring\\\") |> range(start: -30d) |> filter(fn: (r) => r[\\\"_measurement\\\"] == \\\"ransim_ue_positioning\\\") |> yield()\",\n    \"type\": \"flux\"\n}\n"
						},
						"url": {
							"raw": "http://{{InfluxDB_ip}}:{{InfluxDB_port}}/api/v2/query?org=nextworks",
							"protocol": "http",
							"host": [
								"{{InfluxDB_ip}}"
							],
							"port": "{{InfluxDB_port}}",
							"path": [
								"api",
								"v2",
								"query"
							],
							"query": [
								{
									"key": "org",
									"value": "nextworks"
								}
							]
						}
					},
					"response": []
				},
				{
					"name": "Query network_configuration measurement in InfluxDBv2",
					"event": [
						{
							"listen": "test",
							"script": {
								"exec": [
									"// test correctness of the response",
									"pm.test(",
									"    \"Status code is 200\", function () {",
									"        pm.response.to.have.status(200);",
									"    });",
									"// pull the response",
									"var csvData = pm.response.text();",
									"// the Postman console is retrievable at the bottom left corner of the application",
									"console.log(csvData)"
								],
								"type": "text/javascript"
							}
						}
					],
					"request": {
						"auth": {
							"type": "apikey",
							"apikey": [
								{
									"key": "value",
									"value": "Token monitoringToken",
									"type": "string"
								},
								{
									"key": "key",
									"value": "Authorization",
									"type": "string"
								}
							]
						},
						"method": "POST",
						"header": [
							{
								"key": "Content-Type",
								"value": "application/json",
								"type": "text"
							},
							{
								"key": "",
								"value": "",
								"type": "text",
								"disabled": true
							}
						],
						"body": {
							"mode": "raw",
							"raw": "{\n    \"query\":  \"from(bucket: \\\"monitoring\\\") |> range(start: -30d) |> filter(fn: (r) => r[\\\"_measurement\\\"] == \\\"ransim_network_configuration\\\") |> yield()\",\n    \"type\": \"flux\"\n}\n"
						},
						"url": {
							"raw": "http://{{InfluxDB_ip}}:{{InfluxDB_port}}/api/v2/query?org=nextworks",
							"protocol": "http",
							"host": [
								"{{InfluxDB_ip}}"
							],
							"port": "{{InfluxDB_port}}",
							"path": [
								"api",
								"v2",
								"query"
							],
							"query": [
								{
									"key": "org",
									"value": "nextworks"
								}
							]
						}
					},
					"response": []
				},
				{
					"name": "Query resource_configuration measurement in InfluxDBv2",
					"event": [
						{
							"listen": "test",
							"script": {
								"exec": [
									"// test correctness of the response",
									"pm.test(",
									"    \"Status code is 200\", function () {",
									"        pm.response.to.have.status(200);",
									"    });",
									"// pull the response",
									"var csvData = pm.response.text();",
									"// the Postman console is retrievable at the bottom left corner of the application",
									"console.log(csvData)"
								],
								"type": "text/javascript"
							}
						}
					],
					"request": {
						"auth": {
							"type": "apikey",
							"apikey": [
								{
									"key": "value",
									"value": "Token monitoringToken",
									"type": "string"
								},
								{
									"key": "key",
									"value": "Authorization",
									"type": "string"
								}
							]
						},
						"method": "POST",
						"header": [
							{
								"key": "Content-Type",
								"value": "application/json",
								"type": "text"
							},
							{
								"key": "",
								"value": "",
								"type": "text",
								"disabled": true
							}
						],
						"body": {
							"mode": "raw",
							"raw": "{\n    \"query\":  \"from(bucket: \\\"monitoring\\\") |> range(start: -30d) |> filter(fn: (r) => r[\\\"_measurement\\\"] == \\\"ransim_resource_configuration\\\") |> yield()\",\n    \"type\": \"flux\"\n}\n"
						},
						"url": {
							"raw": "http://{{InfluxDB_ip}}:{{InfluxDB_port}}/api/v2/query?org=nextworks",
							"protocol": "http",
							"host": [
								"{{InfluxDB_ip}}"
							],
							"port": "{{InfluxDB_port}}",
							"path": [
								"api",
								"v2",
								"query"
							],
							"query": [
								{
									"key": "org",
									"value": "nextworks"
								}
							]
						}
					},
					"response": []
				},
				{
					"name": "Query network_status measurement in InfluxDBv2",
					"event": [
						{
							"listen": "test",
							"script": {
								"exec": [
									"// test correctness of the response",
									"pm.test(",
									"    \"Status code is 200\", function () {",
									"        pm.response.to.have.status(200);",
									"    });",
									"// pull the response",
									"var csvData = pm.response.text();",
									"// the Postman console is retrievable at the bottom left corner of the application",
									"console.log(csvData)"
								],
								"type": "text/javascript"
							}
						}
					],
					"request": {
						"auth": {
							"type": "apikey",
							"apikey": [
								{
									"key": "value",
									"value": "Token monitoringToken",
									"type": "string"
								},
								{
									"key": "key",
									"value": "Authorization",
									"type": "string"
								}
							]
						},
						"method": "POST",
						"header": [
							{
								"key": "Content-Type",
								"value": "application/json",
								"type": "text"
							},
							{
								"key": "",
								"value": "",
								"type": "text",
								"disabled": true
							}
						],
						"body": {
							"mode": "raw",
							"raw": "{\n    \"query\":  \"from(bucket: \\\"monitoring\\\") |> range(start: -30d) |> filter(fn: (r) => r[\\\"_measurement\\\"] == \\\"ransim_network_status\\\") |> yield()\",\n    \"type\": \"flux\"\n}\n"
						},
						"url": {
							"raw": "http://{{InfluxDB_ip}}:{{InfluxDB_port}}/api/v2/query?org=nextworks",
							"protocol": "http",
							"host": [
								"{{InfluxDB_ip}}"
							],
							"port": "{{InfluxDB_port}}",
							"path": [
								"api",
								"v2",
								"query"
							],
							"query": [
								{
									"key": "org",
									"value": "nextworks"
								}
							]
						}
					},
					"response": []
				}
			]
		},
		{
			"name": "Query OpenWeatherMap data in InfluxDBv2",
			"event": [
				{
					"listen": "test",
					"script": {
						"exec": [
							"// test correctness of the response",
							"pm.test(",
							"    \"Status code is 200\", function () {",
							"        pm.response.to.have.status(200);",
							"    });",
							"// pull the response",
							"var csvData = pm.response.text();",
							"// the Postman console is retrievable at the bottom left corner of the application",
							"console.log(csvData)"
						],
						"type": "text/javascript"
					}
				}
			],
			"request": {
				"auth": {
					"type": "apikey",
					"apikey": [
						{
							"key": "value",
							"value": "Token monitoringToken",
							"type": "string"
						},
						{
							"key": "key",
							"value": "Authorization",
							"type": "string"
						}
					]
				},
				"method": "POST",
				"header": [
					{
						"key": "Content-Type",
						"value": "application/json",
						"type": "text"
					},
					{
						"key": "",
						"value": "",
						"type": "text",
						"disabled": true
					}
				],
				"body": {
					"mode": "raw",
					"raw": "{\n    \"query\":  \"from(bucket: \\\"monitoring\\\") |> range(start: -30d) |> filter(fn: (r) => r[\\\"_measurement\\\"] == \\\"weather\\\") |> yield()\",\n    \"type\": \"flux\"\n}\n"
				},
				"url": {
					"raw": "http://{{InfluxDB_ip}}:{{InfluxDB_port}}/api/v2/query?org=nextworks",
					"protocol": "http",
					"host": [
						"{{InfluxDB_ip}}"
					],
					"port": "{{InfluxDB_port}}",
					"path": [
						"api",
						"v2",
						"query"
					],
					"query": [
						{
							"key": "org",
							"value": "nextworks"
						}
					]
				}
			},
			"response": []
		},
		{
			"name": "Query NWDAF data in InfluxDBv2",
			"event": [
				{
					"listen": "test",
					"script": {
						"exec": [
							"// test correctness of the response",
							"pm.test(",
							"    \"Status code is 200\", function () {",
							"        pm.response.to.have.status(200);",
							"    });",
							"// pull the response",
							"var csvData = pm.response.text();",
							"// the Postman console is retrievable at the bottom left corner of the application",
							"console.log(csvData)"
						],
						"type": "text/javascript"
					}
				}
			],
			"request": {
				"auth": {
					"type": "apikey",
					"apikey": [
						{
							"key": "value",
							"value": "Token monitoringToken",
							"type": "string"
						},
						{
							"key": "key",
							"value": "Authorization",
							"type": "string"
						}
					]
				},
				"method": "POST",
				"header": [
					{
						"key": "Content-Type",
						"value": "application/json",
						"type": "text"
					},
					{
						"key": "",
						"value": "",
						"type": "text",
						"disabled": true
					}
				],
				"body": {
					"mode": "raw",
					"raw": "{\n    \"query\":  \"from(bucket: \\\"monitoring\\\") |> range(start: -30d) |> filter(fn: (r) => r[\\\"_measurement\\\"] == \\\"nwdaf\\\") |> yield()\",\n    \"type\": \"flux\"\n}\n"
				},
				"url": {
					"raw": "http://{{InfluxDB_ip}}:{{InfluxDB_port}}/api/v2/query?org=nextworks",
					"protocol": "http",
					"host": [
						"{{InfluxDB_ip}}"
					],
					"port": "{{InfluxDB_port}}",
					"path": [
						"api",
						"v2",
						"query"
					],
					"query": [
						{
							"key": "org",
							"value": "nextworks"
						}
					]
				}
			},
			"response": []
		},
		{
			"name": "Query Starfish data in InfluxDBv2",
			"event": [
				{
					"listen": "test",
					"script": {
						"exec": [
							"// test correctness of the response",
							"pm.test(",
							"    \"Status code is 200\", function () {",
							"        pm.response.to.have.status(200);",
							"    });",
							"// pull the response",
							"var csvData = pm.response.text();",
							"// the Postman console is retrievable at the bottom left corner of the application",
							"console.log(csvData)"
						],
						"type": "text/javascript"
					}
				}
			],
			"request": {
				"auth": {
					"type": "apikey",
					"apikey": [
						{
							"key": "value",
							"value": "Token monitoringToken",
							"type": "string"
						},
						{
							"key": "key",
							"value": "Authorization",
							"type": "string"
						}
					]
				},
				"method": "POST",
				"header": [
					{
						"key": "Content-Type",
						"value": "application/json",
						"type": "text"
					},
					{
						"key": "",
						"value": "",
						"type": "text",
						"disabled": true
					}
				],
				"body": {
					"mode": "raw",
					"raw": "{\n    \"query\":  \"from(bucket: \\\"monitoring\\\") |> range(start: -30d) |> filter(fn: (r) => r[\\\"_measurement\\\"] == \\\"network_status\\\") |> yield()\",\n    \"type\": \"flux\"\n}\n"
				},
				"url": {
					"raw": "http://{{InfluxDB_ip}}:{{InfluxDB_port}}/api/v2/query?org=nextworks",
					"protocol": "http",
					"host": [
						"{{InfluxDB_ip}}"
					],
					"port": "{{InfluxDB_port}}",
					"path": [
						"api",
						"v2",
						"query"
					],
					"query": [
						{
							"key": "org",
							"value": "nextworks"
						}
					]
				}
			},
			"response": []
		}
	]
}