%YAML 1.1
%TAG !u! tag:unity3d.com,2011:
--- !u!162 &1
EditorUserSettings:
  m_ObjectHideFlags: 0
  serializedVersion: 4
  m_ConfigSettings:
    RecentlyUsedSceneGuid-0:
      value: 570457515c025f035b5e0f2447770a46104f4b7c75717f317a7d4964e4b3606b
      flags: 0
    RecentlyUsedSceneGuid-1:
      value: 525307075403585a545f0f7541770e1617164e727c7e22657d7d196bb7e4326e
      flags: 0
    RecentlyUsedSceneGuid-2:
      value: 06090d025351080a0e5e5f7216775a42454f1e7e752973662b2f1b6ab6b96568
      flags: 0
    RecentlyUsedSceneGuid-3:
      value: 515451020600590b0e565a7341770641414e40287a7e2466792a4c62bab16668
      flags: 0
    RecentlyUsedSceneGuid-4:
      value: 5150030500070c0d5f560f7344770842174e1e287e2920647f704c64e6b26368
      flags: 0
    RecentlyUsedSceneGuid-5:
      value: 550951075702585f090f5f7013775c42464e1d7e78797f327d704c31b0b26c60
      flags: 0
    RecentlyUsedSceneGuid-6:
      value: 0554055e53015b5e58565975407207441416417b2a7175652b7a496ae0e2353d
      flags: 0
    RecentlyUsedSceneGuid-7:
      value: 5b520d0503545b0d0c0c0a2715770748154f4d2c7d7d7e627a7d4a35b4e1646a
      flags: 0
    RecentlyUsedSceneGuid-8:
      value: 0603015e53000a5d0f5d0f7346265a444e4e49782f2b7168787b4b36e6b5653e
      flags: 0
    RecentlyUsedSceneGuid-9:
      value: 5353025653025c035f5e5f204175094417151e7f7c2975682e7c4563b2e46d6f
      flags: 0
    vcSharedLogLevel:
      value: 0d5e400f0650
      flags: 0
  m_VCAutomaticAdd: 1
  m_VCDebugCom: 0
  m_VCDebugCmd: 0
  m_VCDebugOut: 0
  m_SemanticMergeMode: 2
  m_DesiredImportWorkerCount: 2
  m_StandbyImportWorkerCount: 2
  m_IdleImportWorkerShutdownDelay: 60000
  m_VCShowFailedCheckout: 1
  m_VCOverwriteFailedCheckoutAssets: 1
  m_VCProjectOverlayIcons: 1
  m_VCHierarchyOverlayIcons: 1
  m_VCOtherOverlayIcons: 1
  m_VCAllowAsyncUpdate: 1
  m_ArtifactGarbageCollection: 1
