<svg width="9" height="5" viewBox="0 0 9 5" fill="none" xmlns="http://www.w3.org/2000/svg">
<path fill-rule="evenodd" clip-rule="evenodd" d="M0 0.775051L0.775051 0L4.22495 3.44935L7.67376 0L8.4488 0.775051L4.22494 5L0 0.775051Z" fill="black"/>
</svg>
