<svg width="210" height="210" viewBox="0 0 210 210" fill="none" xmlns="http://www.w3.org/2000/svg">
<path d="M64.0151 165.089C72.7953 163.372 79.5157 150.264 78.8769 139.228C78.2196 127.87 70.2078 126.296 64.5782 112.478C58.183 96.7805 65.3646 91.0628 62.0634 67.7153C61.3186 62.4477 57.0084 31.9641 46.153 30.385C36.1159 28.9248 19.0954 51.9731 22.3493 71.1692C24.6695 84.8569 35.5901 86.5108 38.2473 102.471C40.5787 116.476 32.9423 119.835 35.068 133.397C37.6559 149.908 52.4866 167.342 64.0151 165.089Z" fill="#DAE3FE"/>
<path d="M66.1664 168.644C57.0298 152.655 50.5743 124.845 46.7678 104.331C42.6466 82.1204 40.6553 63.4399 40.6357 63.2537L41.3923 63.174C41.4119 63.3598 43.4007 82.0155 47.5168 104.197C51.3125 124.652 57.7438 152.371 66.8271 168.266L66.1664 168.644Z" fill="#F0F0F0"/>
<path d="M103.712 131.091C118.635 126.728 128.066 103.447 121.939 94.0565C117.798 87.7116 109.24 91.8231 103.146 84.8885C95.3653 76.0347 104.743 64.1276 100.938 45.5169C97.6991 29.679 85.7176 12.9231 76.5488 14.0543C66.9511 15.2382 57.8324 36.3429 62.8931 51.1371C66.184 60.758 73.7582 62.7012 73.8274 71.0558C73.9077 80.7498 63.7514 83.1483 61.9095 92.1658C58.6009 108.364 83.9695 136.864 103.712 131.091Z" fill="#DAE3FE"/>
<path d="M95.1838 135.841C95.2645 135.857 95.3499 135.855 95.4349 135.833C95.7351 135.754 95.9146 135.447 95.836 135.147C85.2361 94.6416 88.4829 50.7353 88.5167 50.2965C88.5408 49.9872 88.3092 49.7167 88.0003 49.6932C87.6911 49.6692 87.4208 49.9004 87.397 50.2097C87.3628 50.6503 84.1023 94.7452 94.7494 135.432C94.8057 135.647 94.9793 135.8 95.1838 135.841Z" fill="url(#paint0_linear_0_918)"/>
<path d="M72.2708 58.6107C72.3274 58.6218 72.3881 58.6149 72.4436 58.5872C72.5759 58.5205 72.6293 58.3592 72.5627 58.2268C68.3445 49.839 64.2371 37.68 68.6263 27.3874C71.2402 21.2575 75.6874 18.6723 75.732 18.6468C75.8607 18.5736 75.9058 18.4098 75.8325 18.2809C75.7591 18.152 75.5952 18.1069 75.4664 18.1805C75.2779 18.2877 70.8168 20.8819 68.1325 27.1769C65.6654 32.9624 64.3482 43.0875 72.0831 58.4679C72.1218 58.5448 72.1925 58.5951 72.2708 58.6107Z" fill="#F0F0F0"/>
<path d="M105.572 128.107C105.656 128.123 105.746 128.1 105.812 128.035C117.028 117.067 121.941 107.847 120.412 100.632C119.052 94.2166 112.877 91.8477 112.815 91.8243C112.675 91.7735 112.521 91.8434 112.469 91.9822C112.418 92.1207 112.488 92.2755 112.627 92.3273C112.687 92.3496 118.594 94.624 119.888 100.75C121.371 107.773 116.509 116.824 105.437 127.652C105.331 127.755 105.329 127.925 105.432 128.031C105.472 128.071 105.52 128.096 105.572 128.107Z" fill="#F0F0F0"/>
<path d="M178.734 102.612C178.734 138.063 148.908 166.802 112.116 166.802C75.3244 166.802 43.8509 136.807 43.8509 101.356C43.8509 65.9045 75.3244 38.4215 112.116 38.4215C148.908 38.4215 178.734 67.1605 178.734 102.612Z" fill="#CBD6F6"/>
<path d="M169.67 102.612C169.67 133.299 143.853 158.175 112.006 158.175C80.1582 158.175 52.9145 132.212 52.9145 101.525C52.9145 70.8378 80.1582 47.048 112.006 47.048C143.853 47.048 169.67 71.9247 169.67 102.612Z" fill="#DAE3FE"/>
<path d="M169.67 102.612C169.67 71.9247 143.853 47.048 112.006 47.048C94.7605 47.048 78.8676 54.0262 67.9168 65.2954L112.338 100.909L121.469 157.426C148.814 153.075 169.67 130.192 169.67 102.612Z" fill="#DAE3FE"/>
<path d="M161.822 98.7488C161.822 126.443 138.038 148.894 108.699 148.894C79.3605 148.894 54.2627 125.462 54.2627 97.7679C54.2627 70.0734 79.3605 48.6038 108.699 48.6038C138.038 48.6038 161.822 71.0545 161.822 98.7488Z" fill="white"/>
<path d="M67.6516 99.7298C67.5089 102.088 65.4092 103.889 62.9613 103.752C60.5136 103.614 58.6448 101.591 58.7873 99.2327C58.9298 96.8742 61.0298 95.0733 63.4775 95.2106C65.9251 95.3479 67.794 97.3711 67.6516 99.7298Z" fill="#CBD6F6"/>
<path opacity="0.78" d="M163.566 105.109C163.423 107.467 161.323 109.268 158.876 109.131C156.428 108.994 154.559 106.97 154.701 104.612C154.844 102.253 156.944 100.452 159.392 100.59C161.839 100.727 163.708 102.75 163.566 105.109Z" fill="white"/>
<path d="M103.342 143.497C105.754 143.922 107.352 146.15 106.912 148.474C106.471 150.798 104.159 152.338 101.747 151.914C99.3348 151.489 97.7367 149.261 98.1772 146.937C98.6177 144.613 100.93 143.073 103.342 143.497Z" fill="#CBD6F6"/>
<path d="M120.605 52.428C123.017 52.8524 124.616 55.0807 124.175 57.4048C123.734 59.729 121.422 61.2688 119.01 60.8443C116.598 60.4199 115 58.1916 115.44 55.8675C115.881 53.5435 118.193 52.0036 120.605 52.428Z" fill="#CBD6F6"/>
<path opacity="0.78" d="M134.905 145.942C135.356 147.039 135.244 148.066 134.653 148.236C134.063 148.406 133.219 147.655 132.768 146.558C132.316 145.461 132.429 144.434 133.019 144.264C133.61 144.094 134.454 144.845 134.905 145.942Z" fill="white"/>
<path d="M96.3192 59.5631C96.7703 60.6599 96.6576 61.6869 96.0674 61.8569C95.4771 62.0271 94.633 61.2757 94.1816 60.1791C93.7305 59.0823 93.8431 58.0552 94.4334 57.8851C95.0237 57.7151 95.8681 58.4664 96.3192 59.5631Z" fill="#CBD6F6"/>
<path opacity="0.78" d="M155.053 129.522C156.029 130.234 156.486 131.168 156.074 131.608C155.661 132.049 154.535 131.829 153.558 131.118C152.581 130.406 152.124 129.472 152.537 129.031C152.95 128.591 154.076 128.81 155.053 129.522Z" fill="white"/>
<path d="M75.5288 75.0036C76.5054 75.7153 76.9625 76.6494 76.5497 77.0899C76.137 77.5307 75.0106 77.311 74.034 76.5994C73.0574 75.8877 72.6003 74.9536 73.0132 74.5129C73.426 74.0723 74.5523 74.2922 75.5288 75.0036Z" fill="#CBD6F6"/>
<path opacity="0.78" d="M157.583 80.6127C158.689 80.1056 159.76 80.1451 159.975 80.7013C160.191 81.2574 159.469 82.1192 158.364 82.6265C157.258 83.1337 156.187 83.0941 155.972 82.5379C155.756 81.9819 156.478 81.1199 157.583 80.6127Z" fill="white"/>
<path opacity="0.78" d="M70.7231 123.495C71.8286 122.988 72.8996 123.027 73.1152 123.583C73.3309 124.139 72.6095 125.001 71.504 125.508C70.3987 126.016 69.3275 125.976 69.1119 125.42C68.8962 124.864 69.6177 124.002 70.7231 123.495Z" fill="white"/>
<path d="M139.23 62.343C139.901 61.3564 140.838 60.8544 141.322 61.2218C141.806 61.5893 141.654 62.6868 140.982 63.6734C140.311 64.6598 139.374 65.1618 138.891 64.7945C138.406 64.4271 138.559 63.3295 139.23 62.343Z" fill="#DAE3FE"/>
<path d="M88.1035 142.448C88.775 141.461 89.7118 140.959 90.1956 141.327C90.6795 141.694 90.5274 142.792 89.856 143.778C89.1847 144.765 88.2478 145.267 87.7639 144.899C87.28 144.532 87.4321 143.434 88.1035 142.448Z" fill="#CBD6F6"/>
<path d="M110.21 100.89L74.5461 118.029C73.8552 118.361 73.0465 117.862 73.0699 117.118L73.21 112.695C73.2371 111.834 72.1853 111.358 71.5148 111.927L45.7283 133.803C44.9396 134.473 45.5883 135.715 46.6162 135.504L79.8279 128.671C80.6226 128.507 80.9101 127.558 80.3314 127.008L76.4433 123.314C75.9627 122.857 76.066 122.085 76.6509 121.76L111.175 102.623C111.656 102.356 111.828 101.769 111.562 101.299C111.299 100.834 110.702 100.654 110.21 100.89Z" fill="#DAE3FE"/>
<path d="M113.93 99.2019L113.859 65.6017C113.871 64.8578 114.703 64.3954 115.377 64.7576L119.389 66.9122C120.169 67.3313 121.093 66.6507 120.877 65.8153L112.579 33.6899C112.326 32.7072 110.882 32.6905 110.604 33.6674L101.623 65.2253C101.408 65.9804 102.151 66.6631 102.924 66.4208L108.117 64.7937C108.759 64.5925 109.422 65.0362 109.452 65.686L111.889 99.23C111.914 99.7641 112.376 100.182 112.931 100.17C113.48 100.159 113.922 99.7312 113.93 99.2019Z" fill="#DAE3FE"/>
<path d="M111.708 105.572C109.089 105.572 106.966 103.527 106.966 101.003C106.966 98.48 109.089 96.4344 111.708 96.4344C114.326 96.4344 116.449 98.48 116.449 101.003C116.449 103.527 114.326 105.572 111.708 105.572Z" fill="#DAE3FE"/>
<path d="M160.78 189.082C157.716 189.347 152.397 189.777 148.204 189.961C145.683 190.072 144.232 189.826 143.396 189.491C143.397 189.585 143.4 189.674 143.404 189.757C143.423 190.198 143.782 190.551 144.228 190.576C152.151 191.018 158.453 190.729 160.696 190.593C161.16 190.564 161.436 190.06 161.199 189.665C161.08 189.467 160.937 189.273 160.78 189.082Z" fill="#696774"/>
<path d="M148.203 189.961C152.396 189.777 157.715 189.347 160.78 189.082C157.767 185.385 148.203 182.893 148.203 182.893H145.502C143.644 185.571 143.375 188.121 143.395 189.491C144.231 189.826 145.682 190.072 148.203 189.961Z" fill="#2A2930"/>
<mask id="path-28-inside-1_0_918" fill="white">
<path fill-rule="evenodd" clip-rule="evenodd" d="M165.593 62.7968C164.846 62.5381 164.067 62.3865 163.277 62.3401C159.028 62.091 145.167 61.6424 133.511 65.3472C133.511 65.3473 133.511 65.3474 133.511 65.3475C133.327 65.4127 130.045 68.2927 129.014 70.659C125.832 77.9592 120.459 96.4782 134.033 104.603C135.132 101.876 136.4 99.6838 137.484 98.0733C135.279 94.3546 134.47 86.7077 138 80.2235C140.979 88.2682 142.376 100.006 142.668 105.2C142.764 106.911 142.464 108.618 141.793 110.197L141.72 110.369C141.577 110.707 141.774 111.095 142.135 111.177C150.184 112.985 158.556 112.493 161.057 112.287C161.504 112.25 161.874 111.93 161.977 111.499C165.891 95.0068 165.9 83.7571 164.942 76.6455C168.603 77.4641 179.799 79.21 188.701 72.5841C187.906 67.3229 186.08 64.1929 184.947 62.688C180.056 64.8977 173.694 65.6041 165.593 62.7968Z"/>
</mask>
<path fill-rule="evenodd" clip-rule="evenodd" d="M165.593 62.7968C164.846 62.5381 164.067 62.3865 163.277 62.3401C159.028 62.091 145.167 61.6424 133.511 65.3472C133.511 65.3473 133.511 65.3474 133.511 65.3475C133.327 65.4127 130.045 68.2927 129.014 70.659C125.832 77.9592 120.459 96.4782 134.033 104.603C135.132 101.876 136.4 99.6838 137.484 98.0733C135.279 94.3546 134.47 86.7077 138 80.2235C140.979 88.2682 142.376 100.006 142.668 105.2C142.764 106.911 142.464 108.618 141.793 110.197L141.72 110.369C141.577 110.707 141.774 111.095 142.135 111.177C150.184 112.985 158.556 112.493 161.057 112.287C161.504 112.25 161.874 111.93 161.977 111.499C165.891 95.0068 165.9 83.7571 164.942 76.6455C168.603 77.4641 179.799 79.21 188.701 72.5841C187.906 67.3229 186.08 64.1929 184.947 62.688C180.056 64.8977 173.694 65.6041 165.593 62.7968Z" fill="white"/>
<path d="M163.277 62.3401L163.336 61.3418L163.336 61.3418L163.277 62.3401ZM165.593 62.7968L165.92 61.8519L165.92 61.852L165.593 62.7968ZM133.511 65.3472L132.542 65.5949L132.308 64.6802L133.208 64.3942L133.511 65.3472ZM133.511 65.3475L134.48 65.0998L134.706 65.9844L133.845 66.2899L133.511 65.3475ZM129.014 70.659L129.93 71.0585L129.93 71.0585L129.014 70.659ZM134.033 104.603L134.961 104.977L134.524 106.062L133.52 105.461L134.033 104.603ZM137.484 98.0733L138.344 97.5634L138.667 98.1073L138.313 98.6318L137.484 98.0733ZM138 80.2235L137.121 79.7454L138.173 77.8129L138.937 79.8763L138 80.2235ZM142.668 105.2L141.67 105.257L141.67 105.256L142.668 105.2ZM141.793 110.197L140.873 109.806L140.873 109.806L141.793 110.197ZM141.72 110.369L142.641 110.76L142.64 110.76L141.72 110.369ZM142.135 111.177L142.354 110.201L142.354 110.201L142.135 111.177ZM161.057 112.287L160.975 111.29L160.975 111.29L161.057 112.287ZM161.977 111.499L161.004 111.268L161.004 111.268L161.977 111.499ZM164.942 76.6455L163.95 76.779L163.759 75.3563L165.16 75.6696L164.942 76.6455ZM188.701 72.5841L189.69 72.4346L189.78 73.028L189.298 73.3863L188.701 72.5841ZM184.947 62.688L184.535 61.7767L185.264 61.4473L185.745 62.0863L184.947 62.688ZM163.336 61.3418C164.215 61.3934 165.084 61.5623 165.92 61.8519L165.266 63.7417C164.608 63.5139 163.92 63.3796 163.219 63.3384L163.336 61.3418ZM133.208 64.3942C145.051 60.6301 159.069 61.0917 163.336 61.3418L163.219 63.3384C158.986 63.0903 145.283 62.6548 133.814 66.3002L133.208 64.3942ZM132.542 65.5952C132.543 65.6007 132.544 65.6051 132.545 65.6078C132.546 65.6102 132.546 65.6122 132.546 65.6119C132.546 65.6119 132.546 65.6119 132.546 65.6118C132.546 65.6118 132.546 65.6118 132.546 65.6118C132.546 65.6117 132.546 65.6117 132.546 65.6116C132.546 65.6114 132.546 65.6111 132.546 65.6108C132.546 65.6101 132.546 65.609 132.545 65.6076C132.544 65.6049 132.543 65.6005 132.542 65.5949L134.479 65.0995C134.478 65.094 134.477 65.0896 134.476 65.0869C134.476 65.0845 134.475 65.0825 134.475 65.0828C134.475 65.0828 134.475 65.0828 134.475 65.0829C134.475 65.0829 134.475 65.0829 134.475 65.0829C134.475 65.083 134.475 65.083 134.475 65.0831C134.475 65.0833 134.475 65.0836 134.475 65.0839C134.476 65.0846 134.476 65.0857 134.476 65.0871C134.477 65.0898 134.478 65.0942 134.48 65.0998L132.542 65.5952ZM128.097 70.2595C128.686 68.9069 129.869 67.4897 130.855 66.4517C131.36 65.9201 131.838 65.4623 132.205 65.1304C132.388 64.9648 132.548 64.8266 132.673 64.724C132.735 64.6734 132.795 64.6258 132.849 64.586C132.876 64.5665 132.909 64.5427 132.946 64.5193C132.961 64.5094 133.053 64.4487 133.176 64.4051L133.845 66.2899C133.914 66.2656 133.962 66.2395 133.979 66.2304C134.001 66.2184 134.017 66.2086 134.023 66.2043C134.037 66.1957 134.041 66.192 134.033 66.1978C134.019 66.2085 133.989 66.2318 133.941 66.2708C133.847 66.3474 133.713 66.4633 133.546 66.6139C133.214 66.9143 132.773 67.3367 132.305 67.829C131.346 68.8388 130.372 70.0448 129.93 71.0585L128.097 70.2595ZM133.52 105.461C126.323 101.154 124.194 94.0833 124.24 87.3151C124.286 80.5712 126.477 73.9765 128.097 70.2595L129.93 71.0585C128.369 74.6417 126.283 80.9566 126.24 87.3286C126.197 93.6762 128.169 99.9279 134.547 103.745L133.52 105.461ZM138.313 98.6318C137.262 100.194 136.029 102.324 134.961 104.977L133.106 104.23C134.234 101.428 135.537 99.174 136.654 97.5149L138.313 98.6318ZM138.878 80.7016C137.206 83.772 136.556 87.1314 136.591 90.174C136.626 93.2316 137.352 95.8902 138.344 97.5634L136.624 98.5833C135.411 96.5377 134.63 93.5135 134.591 90.197C134.553 86.8654 135.263 83.1593 137.121 79.7454L138.878 80.7016ZM141.67 105.256C141.38 100.098 139.989 88.4767 137.062 80.5708L138.937 79.8763C141.968 88.0598 143.373 99.9138 143.667 105.144L141.67 105.256ZM140.873 109.806C141.484 108.367 141.757 106.813 141.67 105.257L143.667 105.144C143.772 107.009 143.444 108.869 142.714 110.588L140.873 109.806ZM140.799 109.979L140.873 109.806L142.714 110.587L142.641 110.76L140.799 109.979ZM141.916 112.152C140.945 111.934 140.413 110.889 140.8 109.978L142.64 110.76C142.741 110.524 142.603 110.257 142.354 110.201L141.916 112.152ZM161.139 113.283C158.609 113.492 150.116 113.994 141.916 112.152L142.354 110.201C150.253 111.975 158.502 111.494 160.975 111.29L161.139 113.283ZM162.95 111.73C162.747 112.584 162.016 113.211 161.139 113.283L160.975 111.29C160.983 111.289 160.989 111.287 160.995 111.282C161.001 111.277 161.003 111.272 161.004 111.268L162.95 111.73ZM165.933 76.5119C166.91 83.7643 166.887 95.1387 162.95 111.73L161.004 111.268C164.894 94.8748 164.89 83.7499 163.95 76.779L165.933 76.5119ZM189.298 73.3863C180.02 80.2918 168.431 78.4505 164.723 77.6214L165.16 75.6696C168.774 76.4778 179.577 78.1283 188.104 71.7819L189.298 73.3863ZM185.745 62.0863C186.973 63.7161 188.868 67 189.69 72.4346L187.712 72.7336C186.943 67.6458 185.188 64.6696 184.148 63.2897L185.745 62.0863ZM165.92 61.852C173.799 64.582 179.895 63.8731 184.535 61.7767L185.358 63.5993C180.217 65.9222 173.589 66.6261 165.266 63.7417L165.92 61.852Z" fill="#2E2D35" mask="url(#path-28-inside-1_0_918)"/>
<path d="M145.047 178.484L145.3 183.486C145.327 184.027 145.733 184.482 146.275 184.56C146.815 184.637 147.538 184.647 148.304 184.392C148.776 184.235 149.126 183.837 149.213 183.353L150.086 178.484L145.047 178.484Z" fill="url(#paint1_linear_0_918)"/>
<path d="M113.697 194.852C112.368 194.612 111.767 193.72 111.514 192.766C111.513 192.775 111.511 192.783 111.51 192.792C111.314 193.798 111.767 194.841 112.674 195.337C113.769 195.936 114.967 196.039 115.896 195.989C116.894 195.936 117.81 195.402 118.313 194.549L118.32 194.536C117.319 195.176 115.913 195.251 113.697 194.852Z" fill="#696774"/>
<path d="M119.963 180.025H117.736C114.343 179.935 112.212 189.184 111.514 192.766C111.767 193.72 112.368 194.612 113.697 194.852C115.913 195.251 117.319 195.176 118.32 194.536C120.153 191.418 121.062 186.852 121.499 184.187C121.996 181.157 119.963 180.025 119.963 180.025Z" fill="#2A2930"/>
<path d="M118.022 175.382L116.785 180.301C116.634 180.905 116.922 181.529 117.48 181.815C118.172 182.17 119.146 182.543 120.042 182.435C120.463 182.384 120.812 182.088 120.952 181.691L122.768 176.515L118.022 175.382Z" fill="url(#paint2_linear_0_918)"/>
<path d="M161.535 110.586C161.535 110.586 150.481 179.683 150.663 180.062C150.663 180.062 147.61 181.45 144.281 180.239C144.281 180.239 145.281 143.302 147.623 129.14C147.623 129.14 128.758 162.154 122.767 178.605C122.767 178.605 119.643 178.232 117.056 176.53C117.056 176.53 137.369 117.105 142.788 109.19L161.535 110.586Z" fill="#2A2930"/>
<path d="M145.094 52.733C145.094 52.733 144.28 61.3424 143.563 63.8891C143.454 64.2755 143.622 64.6829 143.973 64.8835C145.19 65.5788 148.108 66.7128 152.1 64.7563C152.747 64.4394 153.135 63.7653 153.105 63.0518L152.754 54.7324L145.094 52.733Z" fill="url(#paint3_linear_0_918)"/>
<path d="M152.929 41.7188C152.929 41.7188 155.534 47.7014 155.709 50.8416C155.883 53.9816 156.56 56.0192 152.929 56.6516C149.299 57.2839 146.24 55.4752 144.583 52.3472C144.583 52.3472 141.987 47.5275 142.569 45.5537C143.151 43.5798 152.929 41.7188 152.929 41.7188Z" fill="url(#paint4_linear_0_918)"/>
<path d="M145.824 50.0984L146.031 50.0073C146.294 49.8913 146.406 49.5781 146.274 49.3227C145.762 48.3335 144.764 46.0666 146.053 45.5378C147.268 45.0396 148.583 44.7599 149.832 44.3599C150.991 43.9888 153.243 43.6003 153.848 42.3771C154.023 42.0234 153.831 41.6063 153.642 41.2597C153.29 40.611 152.937 39.9623 152.584 39.3136C152.286 38.7652 151.977 38.2037 151.501 37.799C150.413 36.8726 149.115 37.6857 147.911 37.908C143.431 38.7347 140.47 40.5473 140.396 43.6424C140.392 43.8391 140.182 43.9484 140.014 43.8461C139.684 43.6445 139.154 43.55 138.447 44.1447C137.217 45.1791 137.72 47.8623 140.417 50.0694C140.545 50.1742 140.544 50.3742 140.405 50.4645C139.916 50.7827 139.188 51.54 141.076 52.5495C143.029 53.5935 144.488 53.5079 145.049 53.4152C145.189 53.3921 145.279 53.2568 145.249 53.1185L144.649 50.3981C144.615 50.2441 144.733 50.0983 144.89 50.0983H145.824V50.0984Z" fill="#2A2930"/>
<path d="M145.937 50.6724C145.937 50.6724 144.943 46.8507 143.23 47.9223C141.516 48.9938 144.119 52.2043 145.496 52.3473L145.937 50.6724Z" fill="url(#paint5_linear_0_918)"/>
<path d="M155.083 42.7358C150.823 30.107 133.149 38.0682 138.977 49.0716C145.095 46.3012 152.221 41.862 155.083 42.7358Z" fill="#605F66"/>
<path d="M144.667 46.0934L155.774 47.5531C156.056 47.5902 156.338 47.4766 156.514 47.2531C157.796 45.6267 159.43 44.7238 161.344 44.3934C161.586 44.3516 161.593 44.006 161.354 43.9501L154.653 42.3849C154.646 42.3831 154.638 42.3819 154.631 42.3812C151.212 42.0904 147.891 43.6349 144.606 45.8317C144.496 45.905 144.536 46.0762 144.667 46.0934Z" fill="#605F66"/>
<path d="M142.251 109.861C139.703 109.91 137.612 107.858 137.612 105.31V85.055C137.612 82.3937 139.751 80.2285 142.412 80.1994C150.398 80.1125 166.87 80.1081 180.347 81.2438C182.186 81.3988 183.617 82.9061 183.684 84.7506L184.943 104.333C185.037 106.923 182.989 109.087 180.398 109.136L142.251 109.861Z" fill="#2A2930"/>
<path d="M142.237 87.2464C142.203 88.9699 142.255 91.7044 142.296 93.4712C142.318 94.3903 143.125 95.0909 144.038 94.9838L150.611 94.2135C151.487 94.1109 152.103 93.3039 151.973 92.432L151.166 87.0501C151.051 86.2861 150.395 85.7208 149.623 85.7208H143.798C142.949 85.7208 142.254 86.3979 142.237 87.2464Z" fill="white"/>
<path opacity="0.37" d="M159.414 97.446L164.896 98.0373C165.664 98.1202 166.318 97.4874 166.262 96.7179L165.063 80.4085C162.765 80.3356 160.498 80.2824 158.31 80.2451V96.2169C158.31 96.8483 158.786 97.3782 159.414 97.446Z" fill="white"/>
<path d="M161.661 94.6193C161.678 94.9126 161.921 95.1389 162.211 95.1389C162.222 95.1389 162.232 95.1385 162.243 95.1377C162.547 95.1201 162.78 94.8595 162.762 94.5554L161.935 80.321C161.564 80.3119 161.197 80.3036 160.829 80.2954L161.661 94.6193Z" fill="white"/>
<path d="M145.278 92.3842C145.181 92.3842 145.1 92.3095 145.094 92.2118L144.81 87.7284C144.803 87.6272 144.88 87.5399 144.982 87.5334C145.088 87.5252 145.17 87.6041 145.177 87.7054L145.461 92.1889C145.467 92.2901 145.391 92.3773 145.289 92.3838C145.285 92.3842 145.281 92.3842 145.278 92.3842Z" fill="#2A2930"/>
<path d="M145.863 92.3841C145.764 92.3841 145.682 92.3059 145.679 92.2064L145.53 87.6372C145.527 87.5356 145.607 87.4505 145.708 87.4472C145.825 87.4415 145.894 87.5237 145.898 87.6249L146.047 92.1942C146.05 92.2957 145.97 92.3809 145.869 92.3841C145.869 92.3841 145.865 92.3841 145.863 92.3841Z" fill="#2A2930"/>
<path d="M146.656 92.3837C146.758 92.3791 146.836 92.2929 146.831 92.1917C146.758 90.6568 146.619 87.7291 146.617 87.6292C146.616 87.5287 146.534 87.4471 146.433 87.4471C146.331 87.4471 146.249 87.5294 146.249 87.631C146.249 87.7067 146.428 91.4578 146.464 92.2089C146.469 92.3076 146.55 92.3841 146.647 92.3841C146.65 92.3841 146.653 92.3841 146.656 92.3837Z" fill="#2A2930"/>
<path d="M147.873 92.5679C147.676 92.5679 147.513 92.4117 147.506 92.2132C147.351 87.7862 147.378 87.6863 147.396 87.6202C147.449 87.4239 147.653 87.3087 147.848 87.3621C148.027 87.4112 148.14 87.5858 148.115 87.7656C148.104 88.0317 148.186 90.6075 148.241 92.1873C148.248 92.3901 148.089 92.5607 147.887 92.5675C147.882 92.5679 147.878 92.5679 147.873 92.5679Z" fill="#2A2930"/>
<path d="M148.67 92.3841C148.569 92.3841 148.486 92.3019 148.486 92.2003V87.7168C148.486 87.6152 148.569 87.533 148.67 87.533C148.772 87.533 148.854 87.6152 148.854 87.7168V92.2003C148.854 92.3019 148.772 92.3841 148.67 92.3841Z" fill="#2A2930"/>
<path d="M149.313 92.3841C149.213 92.3841 149.131 92.3044 149.129 92.2045C149.094 90.6467 149.012 88.1021 148.938 87.7962C148.906 87.7384 148.906 87.6652 148.945 87.6055C149.001 87.5201 149.115 87.4971 149.2 87.5527C149.3 87.6184 149.395 87.6805 149.497 92.1959C149.499 92.2975 149.419 92.3815 149.318 92.384H149.313V92.3841Z" fill="#2A2930"/>
<path d="M144.288 92.7924C144.094 92.7924 143.932 92.6401 143.921 92.4438L143.676 87.7359C143.665 87.5331 143.821 87.3604 144.024 87.3496C144.217 87.3359 144.4 87.4951 144.41 87.6979L144.656 92.4057C144.666 92.6086 144.51 92.7813 144.308 92.792C144.301 92.7924 144.295 92.7924 144.288 92.7924Z" fill="#2A2930"/>
<path d="M155.814 80.952C153.907 80.9882 152.341 79.4522 152.341 77.5448V62.382C152.341 60.3897 153.942 58.7688 155.934 58.7471C161.913 58.682 174.243 58.6788 184.333 59.529C185.709 59.645 186.78 60.7734 186.83 62.1541L187.773 76.8135C187.843 78.7526 186.31 80.3725 184.37 80.4094L155.814 80.952Z" fill="#FFCB00"/>
<path d="M155.804 64.0226C155.779 65.3128 155.817 67.3599 155.848 68.6825C155.865 69.3705 156.469 69.8949 157.152 69.8147L162.073 69.2381C162.728 69.1612 163.19 68.5571 163.092 67.9044L162.488 63.8756C162.402 63.3036 161.911 62.8805 161.332 62.8805H156.972C156.337 62.8805 155.816 63.3873 155.804 64.0226Z" fill="white"/>
<path opacity="0.37" d="M168.661 71.6578L172.765 72.1007C173.34 72.1626 173.83 71.689 173.787 71.1128L172.89 58.9036C171.17 58.8491 169.473 58.8093 167.835 58.7814V70.7379C167.835 71.2105 168.191 71.6072 168.661 71.6578Z" fill="white"/>
<path d="M170.344 69.5418C170.357 69.7614 170.539 69.9307 170.756 69.9307C170.764 69.9307 170.772 69.9305 170.78 69.9299C171.008 69.9168 171.182 69.7216 171.168 69.4939L170.549 58.8381C170.272 58.8313 169.997 58.8251 169.721 58.819L170.344 69.5418Z" fill="white"/>
<path d="M158.079 67.8685C158.007 67.8685 157.946 67.8126 157.941 67.7394L157.728 64.3832C157.724 64.3074 157.781 64.2421 157.857 64.2373C157.937 64.2311 157.998 64.2902 158.003 64.366L158.216 67.7223C158.221 67.798 158.163 67.8634 158.087 67.8682C158.084 67.8685 158.081 67.8685 158.079 67.8685Z" fill="#2E2D35"/>
<path d="M158.517 67.8685C158.443 67.8685 158.381 67.8099 158.379 67.7354L158.267 64.3149C158.265 64.2389 158.325 64.1751 158.401 64.1727C158.488 64.1685 158.54 64.23 158.543 64.3057L158.654 67.7262C158.657 67.8023 158.597 67.866 158.521 67.8684C158.521 67.8684 158.518 67.8685 158.517 67.8685Z" fill="#2E2D35"/>
<path d="M159.11 67.8683C159.186 67.8647 159.245 67.8003 159.241 67.7245C159.187 66.5754 159.083 64.3837 159.081 64.309C159.08 64.2338 159.019 64.1727 158.943 64.1727C158.867 64.1727 158.806 64.2343 158.806 64.3104C158.806 64.3671 158.939 67.1751 158.966 67.7374C158.97 67.8113 159.031 67.8685 159.104 67.8685C159.106 67.8685 159.108 67.8685 159.11 67.8683Z" fill="#2E2D35"/>
<path d="M160.021 68.0062C159.874 68.0062 159.752 67.8892 159.747 67.7406C159.63 64.4265 159.651 64.3518 159.664 64.3023C159.704 64.1553 159.857 64.069 160.002 64.109C160.137 64.1459 160.221 64.2765 160.203 64.4111C160.194 64.6103 160.255 66.5385 160.297 67.7212C160.302 67.873 160.183 68.0007 160.031 68.0058C160.028 68.0062 160.025 68.0062 160.021 68.0062Z" fill="#2E2D35"/>
<path d="M160.618 67.8685C160.542 67.8685 160.481 67.807 160.481 67.731V64.3747C160.481 64.2986 160.542 64.2371 160.618 64.2371C160.694 64.2371 160.756 64.2986 160.756 64.3747V67.731C160.756 67.807 160.694 67.8685 160.618 67.8685Z" fill="#2E2D35"/>
<path d="M161.1 67.8686C161.025 67.8686 160.964 67.809 160.963 67.7343C160.936 66.568 160.875 64.6632 160.82 64.4341C160.795 64.3909 160.796 64.3361 160.825 64.2915C160.866 64.2274 160.952 64.2103 161.015 64.2519C161.09 64.301 161.161 64.3476 161.238 67.7278C161.239 67.8039 161.179 67.8667 161.103 67.8686H161.1Z" fill="#2E2D35"/>
<path d="M157.338 68.1741C157.192 68.1741 157.071 68.0602 157.063 67.9131L156.879 64.3889C156.872 64.237 156.988 64.1077 157.14 64.0996C157.284 64.0895 157.421 64.2085 157.429 64.3604L157.613 67.8846C157.621 68.0365 157.504 68.1658 157.352 68.1738C157.347 68.1741 157.343 68.1741 157.338 68.1741Z" fill="#2E2D35"/>
<path d="M189.119 67.5137C188.28 67.3079 186.396 64.7587 186.196 65.6902C185.995 66.6215 186.563 67.8026 186.479 68.1986C186.395 68.5946 185.762 70.813 186.265 71.7439C186.628 72.4156 187.339 74.5282 187.708 75.6524C187.83 76.0255 187.929 76.5182 188.32 76.4743C188.71 76.4305 189.012 75.9054 189.048 75.5145C189.063 75.3575 189.958 67.7194 189.119 67.5137Z" fill="url(#paint6_linear_0_918)"/>
<path d="M146.448 110.483L158.201 110.227C158.201 110.227 147.952 107.33 147.316 108.119C147.316 108.119 140.964 103.945 137.483 98.0732C136.399 99.6839 135.131 101.876 134.032 104.603C137.153 106.435 141.251 109.618 146.448 110.483Z" fill="url(#paint7_linear_0_918)"/>
<path d="M146.117 108.448C146.117 108.448 145.874 113.131 152.021 112.451C155.362 112.081 160.755 108.966 160.755 108.966C160.755 108.966 146.698 108.929 146.117 108.448Z" fill="url(#paint8_linear_0_918)"/>
<defs>
<linearGradient id="paint0_linear_0_918" x1="90.9895" y1="49.669" x2="91.6304" y2="135.879" gradientUnits="userSpaceOnUse">
<stop stop-color="#09005D"/>
<stop offset="1" stop-color="#1A0F91"/>
</linearGradient>
<linearGradient id="paint1_linear_0_918" x1="145.047" y1="181.546" x2="150.086" y2="181.546" gradientUnits="userSpaceOnUse">
<stop stop-color="#FEBBBA"/>
<stop offset="1" stop-color="#FF928E"/>
</linearGradient>
<linearGradient id="paint2_linear_0_918" x1="116.745" y1="178.918" x2="122.768" y2="178.918" gradientUnits="userSpaceOnUse">
<stop stop-color="#FEBBBA"/>
<stop offset="1" stop-color="#FF928E"/>
</linearGradient>
<linearGradient id="paint3_linear_0_918" x1="146.414" y1="72.1192" x2="149.024" y2="58.4196" gradientUnits="userSpaceOnUse">
<stop stop-color="#FEBBBA"/>
<stop offset="1" stop-color="#FF928E"/>
</linearGradient>
<linearGradient id="paint4_linear_0_918" x1="153.475" y1="46.9848" x2="138.587" y2="58.3767" gradientUnits="userSpaceOnUse">
<stop stop-color="#FEBBBA"/>
<stop offset="1" stop-color="#FF928E"/>
</linearGradient>
<linearGradient id="paint5_linear_0_918" x1="151.629" y1="44.5713" x2="136.74" y2="55.9633" gradientUnits="userSpaceOnUse">
<stop stop-color="#FEBBBA"/>
<stop offset="1" stop-color="#FF928E"/>
</linearGradient>
<linearGradient id="paint6_linear_0_918" x1="183.184" y1="55.963" x2="205.207" y2="122.027" gradientUnits="userSpaceOnUse">
<stop stop-color="#FEBBBA"/>
<stop offset="1" stop-color="#FF928E"/>
</linearGradient>
<linearGradient id="paint7_linear_0_918" x1="538.395" y1="-895.911" x2="561.25" y2="-954.366" gradientUnits="userSpaceOnUse">
<stop stop-color="#FEBBBA"/>
<stop offset="1" stop-color="#FF928E"/>
</linearGradient>
<linearGradient id="paint8_linear_0_918" x1="148.831" y1="97.3395" x2="125.977" y2="38.8855" gradientUnits="userSpaceOnUse">
<stop stop-color="#FEBBBA"/>
<stop offset="1" stop-color="#FF928E"/>
</linearGradient>
</defs>
</svg>
