ISim log file
Running: Z:\TP2\exo2\detecteur1_isim_beh.exe -intstyle ise -gui -tclbatch isim.cmd -wdb Z:/TP2/exo2/detecteur1_isim_beh.wdb 
ISim P.20131013 (signature 0x7708f090)
WARNING: A WEBPACK license was found.
WARNING: Please use Xilinx License Configuration Manager to check out a full ISim license.
WARNING: ISim will run in Lite mode. Please refer to the ISim documentation for more information on the differences between the Lite and the Full version.
This is a Lite version of ISim.
Time resolution is 1 ps
# onerror resume
# wave add /
# run 1000 ns
Simulator is doing circuit initialization process.
Finished circuit initialization process.
# isim force add /detecteur1/pb_0 0 -radix bin -value 1 -radix bin -time 250 ns -repeat 500 ns
# run 1.00us
# run 1.00us
# run 1.00us
# run 1.00us
# run 1.00us
# run 1.00us
# run 1.00us
# run 1.00us
# run 1.00us
# isim force add /detecteur1/sw_0 1 -radix bin
# run 1.00us
# run 1.00us
# run 1.00us
# isim force add /detecteur1/sw_0 1 -radix bin
# run 1.00us
# isim force add /detecteur1/sw_0 0 -radix bin
# run 1.00us
# isim force add /detecteur1/pb_0 0 -radix bin -value 1 -radix bin -time 500 ns -repeat 1 us
# isim force add /detecteur1/sw_0 1 -radix bin
# run 1.00us
# run 1.00us
# isim force add /detecteur1/sw_0 0 -radix bin
# run 1.00us
# isim force add /detecteur1/sw_0 1 -radix bin
# run 1.00us
# isim force add /detecteur1/sw_0 0 -radix bin
# run 1.00us
# run 1.00us
# run 1.00us
# run 1.00us
