V3 3
FL //nassme.utc/~mi01a043/TP2/exo1/compteur2bits.vhd 2017/10/06.15:06:43 P.20131013
EN work/compteur2bits 1507295520 \
      FL //nassme.utc/~mi01a043/TP2/exo1/compteur2bits.vhd PB ieee/std_logic_1164 1381692176
AR work/compteur2bits/Behavioral 1507295521 \
      FL //nassme.utc/~mi01a043/TP2/exo1/compteur2bits.vhd EN work/compteur2bits 1507295520
