timeStamp,elapsed,label,responseCode,responseMessage,threadName,dataType,success,failureMessage,bytes,sentBytes,grpThreads,allThreads,URL,Latency,IdleTime,Connect
1648949891862,32,HTTP Request,Non HTTP response code: java.net.SocketException,Non HTTP response message: An established connection was aborted by the software in your host machine,Thread Group 1-1,text,false,,2688,0,2,2,http://127.0.0.1:6001/hello,0,0,30
1648949892848,2,HTTP Request,Non HTTP response code: java.net.SocketException,Non HTTP response message: Connection reset,Thread Group 1-2,text,false,,2630,0,3,3,http://127.0.0.1:6001/hello,0,0,1
1648949892896,2,HTTP Request,Non HTTP response code: java.net.SocketException,Non HTTP response message: Connection reset,Thread Group 1-1,text,false,,2630,0,3,3,http://127.0.0.1:6001/hello,0,0,1
1648949893839,3,HTTP Request,Non HTTP response code: java.net.SocketException,Non HTTP response message: Connection reset,Thread Group 1-2,text,false,,2630,0,4,4,http://127.0.0.1:6001/hello,0,0,2
1648949893845,2,HTTP Request,Non HTTP response code: java.net.SocketException,Non HTTP response message: Connection reset,Thread Group 1-3,text,false,,2630,0,4,4,http://127.0.0.1:6001/hello,0,0,1
1648949893907,1,HTTP Request,Non HTTP response code: java.net.SocketException,Non HTTP response message: Connection reset,Thread Group 1-1,text,false,,2630,0,4,4,http://127.0.0.1:6001/hello,0,0,1
1648949894810,2,HTTP Request,Non HTTP response code: java.net.SocketException,Non HTTP response message: Connection reset,Thread Group 1-3,text,false,,2630,0,5,5,http://127.0.0.1:6001/hello,0,0,1
1648949894815,2,HTTP Request,Non HTTP response code: java.net.SocketException,Non HTTP response message: Connection reset,Thread Group 1-2,text,false,,2630,0,5,5,http://127.0.0.1:6001/hello,0,0,1
1648949894820,1,HTTP Request,Non HTTP response code: java.net.SocketException,Non HTTP response message: Connection reset,Thread Group 1-4,text,false,,2630,0,5,5,http://127.0.0.1:6001/hello,0,0,1
1648949894956,3,HTTP Request,Non HTTP response code: java.net.SocketException,Non HTTP response message: Connection reset,Thread Group 1-1,text,false,,2630,0,5,5,http://127.0.0.1:6001/hello,0,0,1
1648949895763,2,HTTP Request,Non HTTP response code: java.net.SocketException,Non HTTP response message: Connection reset,Thread Group 1-3,text,false,,2630,0,5,5,http://127.0.0.1:6001/hello,0,0,1
1648949895782,2,HTTP Request,Non HTTP response code: java.net.SocketException,Non HTTP response message: Connection reset,Thread Group 1-5,text,false,,2630,0,5,5,http://127.0.0.1:6001/hello,0,0,1
1648949895818,2,HTTP Request,Non HTTP response code: java.net.SocketException,Non HTTP response message: Connection reset,Thread Group 1-2,text,false,,2630,0,6,6,http://127.0.0.1:6001/hello,0,0,1
1648949895821,2,HTTP Request,Non HTTP response code: java.net.SocketException,Non HTTP response message: Connection reset,Thread Group 1-4,text,false,,2630,0,6,6,http://127.0.0.1:6001/hello,0,0,1
1648949895942,2,HTTP Request,Non HTTP response code: java.net.SocketException,Non HTTP response message: Connection reset,Thread Group 1-1,text,false,,2630,0,6,6,http://127.0.0.1:6001/hello,0,0,1
1648949896769,3,HTTP Request,Non HTTP response code: java.net.SocketException,Non HTTP response message: Connection reset,Thread Group 1-3,text,false,,2630,0,6,6,http://127.0.0.1:6001/hello,0,0,2
1648949896790,2,HTTP Request,Non HTTP response code: java.net.SocketException,Non HTTP response message: Connection reset,Thread Group 1-5,text,false,,2630,0,6,6,http://127.0.0.1:6001/hello,0,0,1
1648949896806,3,HTTP Request,Non HTTP response code: java.net.SocketException,Non HTTP response message: Connection reset,Thread Group 1-6,text,false,,2630,0,6,6,http://127.0.0.1:6001/hello,0,0,2
1648949896808,2,HTTP Request,Non HTTP response code: java.net.SocketException,Non HTTP response message: Connection reset,Thread Group 1-4,text,false,,2630,0,6,6,http://127.0.0.1:6001/hello,0,0,1
1648949896866,2,HTTP Request,Non HTTP response code: java.net.SocketException,Non HTTP response message: Connection reset,Thread Group 1-2,text,false,,2630,0,7,7,http://127.0.0.1:6001/hello,0,0,1
1648949896960,3,HTTP Request,Non HTTP response code: java.net.SocketException,Non HTTP response message: Connection reset,Thread Group 1-1,text,false,,2630,0,7,7,http://127.0.0.1:6001/hello,0,0,2
1648949897761,2,HTTP Request,Non HTTP response code: java.net.SocketException,Non HTTP response message: Connection reset,Thread Group 1-4,text,false,,2630,0,7,7,http://127.0.0.1:6001/hello,0,0,1
1648949897765,3,HTTP Request,Non HTTP response code: java.net.SocketException,Non HTTP response message: Connection reset,Thread Group 1-3,text,false,,2630,0,7,7,http://127.0.0.1:6001/hello,0,0,2
1648949897785,2,HTTP Request,Non HTTP response code: java.net.SocketException,Non HTTP response message: Connection reset,Thread Group 1-5,text,false,,2630,0,7,7,http://127.0.0.1:6001/hello,0,0,1
1648949897823,2,HTTP Request,Non HTTP response code: java.net.SocketException,Non HTTP response message: Connection reset,Thread Group 1-6,text,false,,2630,0,8,8,http://127.0.0.1:6001/hello,0,0,1
1648949897854,2,HTTP Request,Non HTTP response code: java.net.SocketException,Non HTTP response message: Connection reset,Thread Group 1-7,text,false,,2630,0,8,8,http://127.0.0.1:6001/hello,0,0,1
1648949897873,2,HTTP Request,Non HTTP response code: java.net.SocketException,Non HTTP response message: Connection reset,Thread Group 1-2,text,false,,2630,0,8,8,http://127.0.0.1:6001/hello,0,0,1
1648949898005,3,HTTP Request,Non HTTP response code: java.net.SocketException,Non HTTP response message: Connection reset,Thread Group 1-1,text,false,,2630,0,8,8,http://127.0.0.1:6001/hello,0,0,2
1648949898720,2,HTTP Request,Non HTTP response code: java.net.SocketException,Non HTTP response message: Connection reset,Thread Group 1-3,text,false,,2630,0,8,8,http://127.0.0.1:6001/hello,0,0,1
1648949898775,2,HTTP Request,Non HTTP response code: java.net.SocketException,Non HTTP response message: Connection reset,Thread Group 1-8,text,false,,2630,0,8,8,http://127.0.0.1:6001/hello,0,0,1
1648949898793,3,HTTP Request,Non HTTP response code: java.net.SocketException,Non HTTP response message: Connection reset,Thread Group 1-4,text,false,,2630,0,8,8,http://127.0.0.1:6001/hello,0,0,2
1648949898830,1,HTTP Request,Non HTTP response code: java.net.SocketException,Non HTTP response message: Connection reset,Thread Group 1-6,text,false,,2630,0,9,9,http://127.0.0.1:6001/hello,0,0,0
1648949898830,1,HTTP Request,Non HTTP response code: java.net.SocketException,Non HTTP response message: Connection reset,Thread Group 1-5,text,false,,2630,0,9,9,http://127.0.0.1:6001/hello,0,0,0
1648949898842,2,HTTP Request,Non HTTP response code: java.net.SocketException,Non HTTP response message: Connection reset,Thread Group 1-7,text,false,,2630,0,9,9,http://127.0.0.1:6001/hello,0,0,1
1648949898867,2,HTTP Request,Non HTTP response code: java.net.SocketException,Non HTTP response message: Connection reset,Thread Group 1-2,text,false,,2630,0,9,9,http://127.0.0.1:6001/hello,0,0,1
1648949899020,2,HTTP Request,Non HTTP response code: java.net.SocketException,Non HTTP response message: Connection reset,Thread Group 1-1,text,false,,2630,0,9,9,http://127.0.0.1:6001/hello,0,0,1
1648949899730,3,HTTP Request,Non HTTP response code: java.net.SocketException,Non HTTP response message: Connection reset,Thread Group 1-3,text,false,,2630,0,9,9,http://127.0.0.1:6001/hello,0,0,2
1648949899765,2,HTTP Request,Non HTTP response code: java.net.SocketException,Non HTTP response message: Connection reset,Thread Group 1-4,text,false,,2630,0,9,9,http://127.0.0.1:6001/hello,0,0,1
1648949899825,2,HTTP Request,Non HTTP response code: java.net.SocketException,Non HTTP response message: Connection reset,Thread Group 1-8,text,false,,2630,0,10,10,http://127.0.0.1:6001/hello,0,0,1
1648949899828,1,HTTP Request,Non HTTP response code: java.net.SocketException,Non HTTP response message: Connection reset,Thread Group 1-6,text,false,,2630,0,10,10,http://127.0.0.1:6001/hello,0,0,1
1648949899850,1,HTTP Request,Non HTTP response code: java.net.SocketException,Non HTTP response message: Connection reset,Thread Group 1-7,text,false,,2630,0,10,10,http://127.0.0.1:6001/hello,0,0,1
1648949899866,1,HTTP Request,Non HTTP response code: java.net.SocketException,Non HTTP response message: Connection reset,Thread Group 1-9,text,false,,2630,0,10,10,http://127.0.0.1:6001/hello,0,0,0
1648949899904,2,HTTP Request,Non HTTP response code: java.net.SocketException,Non HTTP response message: Connection reset,Thread Group 1-2,text,false,,2630,0,10,10,http://127.0.0.1:6001/hello,0,0,1
1648949899909,2,HTTP Request,Non HTTP response code: java.net.SocketException,Non HTTP response message: Connection reset,Thread Group 1-5,text,false,,2630,0,10,10,http://127.0.0.1:6001/hello,0,0,1
1648949899987,2,HTTP Request,Non HTTP response code: java.net.SocketException,Non HTTP response message: Connection reset,Thread Group 1-1,text,false,,2630,0,10,10,http://127.0.0.1:6001/hello,0,0,1
1648949900733,2,HTTP Request,Non HTTP response code: java.net.SocketException,Non HTTP response message: Connection reset,Thread Group 1-4,text,false,,2630,0,10,10,http://127.0.0.1:6001/hello,0,0,1
1648949900747,2,HTTP Request,Non HTTP response code: java.net.SocketException,Non HTTP response message: Connection reset,Thread Group 1-3,text,false,,2630,0,10,10,http://127.0.0.1:6001/hello,0,0,1
1648949900797,2,HTTP Request,Non HTTP response code: java.net.SocketException,Non HTTP response message: Connection reset,Thread Group 1-10,text,false,,2630,0,10,10,http://127.0.0.1:6001/hello,0,0,1
1648949900847,1,HTTP Request,Non HTTP response code: java.net.SocketException,Non HTTP response message: Connection reset,Thread Group 1-8,text,false,,2630,0,10,10,http://127.0.0.1:6001/hello,0,0,0
1648949900848,2,HTTP Request,Non HTTP response code: java.net.SocketException,Non HTTP response message: Connection reset,Thread Group 1-7,text,false,,2630,0,10,10,http://127.0.0.1:6001/hello,0,0,1
1648949900852,2,HTTP Request,Non HTTP response code: java.net.SocketException,Non HTTP response message: Connection reset,Thread Group 1-9,text,false,,2630,0,10,10,http://127.0.0.1:6001/hello,0,0,1
1648949900866,1,HTTP Request,Non HTTP response code: java.net.SocketException,Non HTTP response message: Connection reset,Thread Group 1-6,text,false,,2630,0,10,10,http://127.0.0.1:6001/hello,0,0,1
1648949900885,2,HTTP Request,Non HTTP response code: java.net.SocketException,Non HTTP response message: Connection reset,Thread Group 1-2,text,false,,2630,0,10,10,http://127.0.0.1:6001/hello,0,0,1
1648949900941,3,HTTP Request,Non HTTP response code: java.net.SocketException,Non HTTP response message: Connection reset,Thread Group 1-5,text,false,,2630,0,10,10,http://127.0.0.1:6001/hello,0,0,2
1648949900976,3,HTTP Request,Non HTTP response code: java.net.SocketException,Non HTTP response message: Connection reset,Thread Group 1-1,text,false,,2630,0,10,10,http://127.0.0.1:6001/hello,0,0,2
1648949901748,2,HTTP Request,Non HTTP response code: java.net.SocketException,Non HTTP response message: Connection reset,Thread Group 1-10,text,false,,2630,0,9,9,http://127.0.0.1:6001/hello,0,0,1
1648949901754,2,HTTP Request,Non HTTP response code: java.net.SocketException,Non HTTP response message: Connection reset,Thread Group 1-3,text,false,,2630,0,9,9,http://127.0.0.1:6001/hello,0,0,1
1648949901763,2,HTTP Request,Non HTTP response code: java.net.SocketException,Non HTTP response message: Connection reset,Thread Group 1-4,text,false,,2630,0,9,9,http://127.0.0.1:6001/hello,0,0,1
1648949901790,2,HTTP Request,Non HTTP response code: java.net.SocketException,Non HTTP response message: Connection reset,Thread Group 1-8,text,false,,2630,0,9,9,http://127.0.0.1:6001/hello,0,0,1
1648949901803,2,HTTP Request,Non HTTP response code: java.net.SocketException,Non HTTP response message: Connection reset,Thread Group 1-9,text,false,,2630,0,9,9,http://127.0.0.1:6001/hello,0,0,1
1648949901861,3,HTTP Request,Non HTTP response code: java.net.SocketException,Non HTTP response message: Connection reset,Thread Group 1-7,text,false,,2630,0,9,9,http://127.0.0.1:6001/hello,0,0,2
1648949901882,2,HTTP Request,Non HTTP response code: java.net.SocketException,Non HTTP response message: Connection reset,Thread Group 1-6,text,false,,2630,0,9,9,http://127.0.0.1:6001/hello,0,0,1
1648949901910,3,HTTP Request,Non HTTP response code: java.net.SocketException,Non HTTP response message: Connection reset,Thread Group 1-5,text,false,,2630,0,9,9,http://127.0.0.1:6001/hello,0,0,2
1648949901932,2,HTTP Request,Non HTTP response code: java.net.SocketException,Non HTTP response message: Connection reset,Thread Group 1-2,text,false,,2630,0,9,9,http://127.0.0.1:6001/hello,0,0,1
1648949902682,2,HTTP Request,Non HTTP response code: java.net.SocketException,Non HTTP response message: Connection reset,Thread Group 1-10,text,false,,2630,0,8,8,http://127.0.0.1:6001/hello,0,0,1
1648949902751,3,HTTP Request,Non HTTP response code: java.net.SocketException,Non HTTP response message: Connection reset,Thread Group 1-4,text,false,,2630,0,8,8,http://127.0.0.1:6001/hello,0,0,2
1648949902777,2,HTTP Request,Non HTTP response code: java.net.SocketException,Non HTTP response message: Connection reset,Thread Group 1-3,text,false,,2630,0,8,8,http://127.0.0.1:6001/hello,0,0,2
1648949902798,2,HTTP Request,Non HTTP response code: java.net.SocketException,Non HTTP response message: Connection reset,Thread Group 1-8,text,false,,2630,0,7,7,http://127.0.0.1:6001/hello,0,0,1
1648949902822,2,HTTP Request,Non HTTP response code: java.net.SocketException,Non HTTP response message: Connection reset,Thread Group 1-6,text,false,,2630,0,7,7,http://127.0.0.1:6001/hello,0,0,1
1648949902829,3,HTTP Request,Non HTTP response code: java.net.SocketException,Non HTTP response message: Connection reset,Thread Group 1-9,text,false,,2630,0,7,7,http://127.0.0.1:6001/hello,0,0,0
1648949902848,1,HTTP Request,Non HTTP response code: java.net.SocketException,Non HTTP response message: Connection reset,Thread Group 1-7,text,false,,2630,0,7,7,http://127.0.0.1:6001/hello,0,0,0
1648949902888,2,HTTP Request,Non HTTP response code: java.net.SocketException,Non HTTP response message: Connection reset,Thread Group 1-5,text,false,,2630,0,7,7,http://127.0.0.1:6001/hello,0,0,1
1648949903691,3,HTTP Request,Non HTTP response code: java.net.SocketException,Non HTTP response message: Connection reset,Thread Group 1-10,text,false,,2630,0,7,7,http://127.0.0.1:6001/hello,0,0,1
1648949903756,2,HTTP Request,Non HTTP response code: java.net.SocketException,Non HTTP response message: Connection reset,Thread Group 1-4,text,false,,2630,0,7,7,http://127.0.0.1:6001/hello,0,0,1
1648949903783,1,HTTP Request,Non HTTP response code: java.net.SocketException,Non HTTP response message: Connection reset,Thread Group 1-8,text,false,,2630,0,6,6,http://127.0.0.1:6001/hello,0,0,1
1648949903813,2,HTTP Request,Non HTTP response code: java.net.SocketException,Non HTTP response message: Connection reset,Thread Group 1-6,text,false,,2630,0,6,6,http://127.0.0.1:6001/hello,0,0,1
1648949903865,2,HTTP Request,Non HTTP response code: java.net.SocketException,Non HTTP response message: Connection reset,Thread Group 1-7,text,false,,2630,0,6,6,http://127.0.0.1:6001/hello,0,0,1
1648949903874,2,HTTP Request,Non HTTP response code: java.net.SocketException,Non HTTP response message: Connection reset,Thread Group 1-9,text,false,,2630,0,6,6,http://127.0.0.1:6001/hello,0,0,1
1648949903911,1,HTTP Request,Non HTTP response code: java.net.SocketException,Non HTTP response message: Connection reset,Thread Group 1-5,text,false,,2630,0,6,6,http://127.0.0.1:6001/hello,0,0,1
1648949904714,3,HTTP Request,Non HTTP response code: java.net.SocketException,Non HTTP response message: Connection reset,Thread Group 1-10,text,false,,2630,0,6,6,http://127.0.0.1:6001/hello,0,0,2
1648949904790,2,HTTP Request,Non HTTP response code: java.net.SocketException,Non HTTP response message: Connection reset,Thread Group 1-8,text,false,,2630,0,6,6,http://127.0.0.1:6001/hello,0,0,1
1648949904841,3,HTTP Request,Non HTTP response code: java.net.SocketException,Non HTTP response message: Connection reset,Thread Group 1-7,text,false,,2630,0,6,6,http://127.0.0.1:6001/hello,0,0,2
1648949904861,1,HTTP Request,Non HTTP response code: java.net.SocketException,Non HTTP response message: Connection reset,Thread Group 1-6,text,false,,2630,0,6,6,http://127.0.0.1:6001/hello,0,0,0
1648949904895,2,HTTP Request,Non HTTP response code: java.net.SocketException,Non HTTP response message: Connection reset,Thread Group 1-9,text,false,,2630,0,6,6,http://127.0.0.1:6001/hello,0,0,1
1648949904909,2,HTTP Request,Non HTTP response code: java.net.SocketException,Non HTTP response message: Connection reset,Thread Group 1-5,text,false,,2630,0,6,6,http://127.0.0.1:6001/hello,0,0,1
1648949905708,2,HTTP Request,Non HTTP response code: java.net.SocketException,Non HTTP response message: Connection reset,Thread Group 1-10,text,false,,2630,0,5,5,http://127.0.0.1:6001/hello,0,0,1
1648949905823,2,HTTP Request,Non HTTP response code: java.net.SocketException,Non HTTP response message: Connection reset,Thread Group 1-8,text,false,,2630,0,5,5,http://127.0.0.1:6001/hello,0,0,1
1648949905842,7,HTTP Request,Non HTTP response code: java.net.SocketException,Non HTTP response message: Connection reset,Thread Group 1-6,text,false,,2630,0,5,5,http://127.0.0.1:6001/hello,0,0,2
1648949905881,2,HTTP Request,Non HTTP response code: java.net.SocketException,Non HTTP response message: Connection reset,Thread Group 1-7,text,false,,2630,0,4,4,http://127.0.0.1:6001/hello,0,0,1
1648949905903,2,HTTP Request,Non HTTP response code: java.net.SocketException,Non HTTP response message: Connection reset,Thread Group 1-9,text,false,,2630,0,4,4,http://127.0.0.1:6001/hello,0,0,1
1648949906734,2,HTTP Request,Non HTTP response code: java.net.SocketException,Non HTTP response message: Connection reset,Thread Group 1-10,text,false,,2630,0,4,4,http://127.0.0.1:6001/hello,0,0,1
1648949906869,3,HTTP Request,Non HTTP response code: java.net.SocketException,Non HTTP response message: Connection reset,Thread Group 1-7,text,false,,2630,0,4,4,http://127.0.0.1:6001/hello,0,0,2
1648949906888,2,HTTP Request,Non HTTP response code: java.net.SocketException,Non HTTP response message: Connection reset,Thread Group 1-8,text,false,,2630,0,3,3,http://127.0.0.1:6001/hello,0,0,1
1648949906907,2,HTTP Request,Non HTTP response code: java.net.SocketException,Non HTTP response message: Connection reset,Thread Group 1-9,text,false,,2630,0,3,3,http://127.0.0.1:6001/hello,0,0,1
1648949907795,3,HTTP Request,Non HTTP response code: java.net.SocketException,Non HTTP response message: Connection reset,Thread Group 1-10,text,false,,2630,0,3,3,http://127.0.0.1:6001/hello,0,0,1
1648949907837,2,HTTP Request,Non HTTP response code: java.net.SocketException,Non HTTP response message: Connection reset,Thread Group 1-9,text,false,,2630,0,3,3,http://127.0.0.1:6001/hello,0,0,1
1648949907932,2,HTTP Request,Non HTTP response code: java.net.SocketException,Non HTTP response message: Connection reset,Thread Group 1-8,text,false,,2630,0,3,3,http://127.0.0.1:6001/hello,0,0,1
1648949908821,2,HTTP Request,Non HTTP response code: java.net.SocketException,Non HTTP response message: Connection reset,Thread Group 1-10,text,false,,2630,0,2,2,http://127.0.0.1:6001/hello,0,0,1
1648949908894,3,HTTP Request,Non HTTP response code: java.net.SocketException,Non HTTP response message: Connection reset,Thread Group 1-9,text,false,,2630,0,2,2,http://127.0.0.1:6001/hello,0,0,1
1648949909848,2,HTTP Request,Non HTTP response code: java.net.SocketException,Non HTTP response message: Connection reset,Thread Group 1-10,text,false,,2630,0,1,1,http://127.0.0.1:6001/hello,0,0,1
1648953258866,18,HTTP Request,Non HTTP response code: org.apache.http.conn.HttpHostConnectException,Non HTTP response message: Connect to 127.0.0.1:1001 [/127.0.0.1] failed: Connection refused: connect,Thread Group 1-1,text,false,,2594,0,2,2,http://127.0.0.1:1001/hello,0,0,17
1648953259776,1,HTTP Request,Non HTTP response code: org.apache.http.conn.HttpHostConnectException,Non HTTP response message: Connect to 127.0.0.1:1001 [/127.0.0.1] failed: Connection refused: connect,Thread Group 1-2,text,false,,2594,0,2,2,http://127.0.0.1:1001/hello,0,0,1
1648953259875,2,HTTP Request,Non HTTP response code: org.apache.http.conn.HttpHostConnectException,Non HTTP response message: Connect to 127.0.0.1:1001 [/127.0.0.1] failed: Connection refused: connect,Thread Group 1-1,text,false,,2594,0,3,3,http://127.0.0.1:1001/hello,0,0,2
1648953260748,1,HTTP Request,Non HTTP response code: org.apache.http.conn.HttpHostConnectException,Non HTTP response message: Connect to 127.0.0.1:1001 [/127.0.0.1] failed: Connection refused: connect,Thread Group 1-3,text,false,,2594,0,3,3,http://127.0.0.1:1001/hello,0,0,1
1648953260759,1,HTTP Request,Non HTTP response code: org.apache.http.conn.HttpHostConnectException,Non HTTP response message: Connect to 127.0.0.1:1001 [/127.0.0.1] failed: Connection refused: connect,Thread Group 1-2,text,false,,2594,0,3,3,http://127.0.0.1:1001/hello,0,0,1
1648953260886,1,HTTP Request,Non HTTP response code: org.apache.http.conn.HttpHostConnectException,Non HTTP response message: Connect to 127.0.0.1:1001 [/127.0.0.1] failed: Connection refused: connect,Thread Group 1-1,text,false,,2594,0,4,4,http://127.0.0.1:1001/hello,0,0,1
1648953261741,1,HTTP Request,Non HTTP response code: org.apache.http.conn.HttpHostConnectException,Non HTTP response message: Connect to 127.0.0.1:1001 [/127.0.0.1] failed: Connection refused: connect,Thread Group 1-3,text,false,,2594,0,4,4,http://127.0.0.1:1001/hello,0,0,1
1648953261775,1,HTTP Request,Non HTTP response code: org.apache.http.conn.HttpHostConnectException,Non HTTP response message: Connect to 127.0.0.1:1001 [/127.0.0.1] failed: Connection refused: connect,Thread Group 1-2,text,false,,2594,0,4,4,http://127.0.0.1:1001/hello,0,0,1
1648953261812,1,HTTP Request,Non HTTP response code: org.apache.http.conn.HttpHostConnectException,Non HTTP response message: Connect to 127.0.0.1:1001 [/127.0.0.1] failed: Connection refused: connect,Thread Group 1-4,text,false,,2594,0,5,5,http://127.0.0.1:1001/hello,0,0,1
1648953261902,2,HTTP Request,Non HTTP response code: org.apache.http.conn.HttpHostConnectException,Non HTTP response message: Connect to 127.0.0.1:1001 [/127.0.0.1] failed: Connection refused: connect,Thread Group 1-1,text,false,,2594,0,5,5,http://127.0.0.1:1001/hello,0,0,2
1648953262759,2,HTTP Request,Non HTTP response code: org.apache.http.conn.HttpHostConnectException,Non HTTP response message: Connect to 127.0.0.1:1001 [/127.0.0.1] failed: Connection refused: connect,Thread Group 1-3,text,false,,2594,0,5,5,http://127.0.0.1:1001/hello,0,0,2
1648953262786,1,HTTP Request,Non HTTP response code: org.apache.http.conn.HttpHostConnectException,Non HTTP response message: Connect to 127.0.0.1:1001 [/127.0.0.1] failed: Connection refused: connect,Thread Group 1-5,text,false,,2594,0,5,5,http://127.0.0.1:1001/hello,0,0,1
1648953262825,1,HTTP Request,Non HTTP response code: org.apache.http.conn.HttpHostConnectException,Non HTTP response message: Connect to 127.0.0.1:1001 [/127.0.0.1] failed: Connection refused: connect,Thread Group 1-2,text,false,,2594,0,6,6,http://127.0.0.1:1001/hello,0,0,1
1648953262851,1,HTTP Request,Non HTTP response code: org.apache.http.conn.HttpHostConnectException,Non HTTP response message: Connect to 127.0.0.1:1001 [/127.0.0.1] failed: Connection refused: connect,Thread Group 1-4,text,false,,2594,0,6,6,http://127.0.0.1:1001/hello,0,0,1
1648953262853,1,HTTP Request,Non HTTP response code: org.apache.http.conn.HttpHostConnectException,Non HTTP response message: Connect to 127.0.0.1:1001 [/127.0.0.1] failed: Connection refused: connect,Thread Group 1-1,text,false,,2594,0,6,6,http://127.0.0.1:1001/hello,0,0,1
1648953263727,2,HTTP Request,Non HTTP response code: org.apache.http.conn.HttpHostConnectException,Non HTTP response message: Connect to 127.0.0.1:1001 [/127.0.0.1] failed: Connection refused: connect,Thread Group 1-5,text,false,,2594,0,6,6,http://127.0.0.1:1001/hello,0,0,1
1648953263742,2,HTTP Request,Non HTTP response code: org.apache.http.conn.HttpHostConnectException,Non HTTP response message: Connect to 127.0.0.1:1001 [/127.0.0.1] failed: Connection refused: connect,Thread Group 1-6,text,false,,2594,0,6,6,http://127.0.0.1:1001/hello,0,0,2
1648953263787,0,HTTP Request,Non HTTP response code: org.apache.http.conn.HttpHostConnectException,Non HTTP response message: Connect to 127.0.0.1:1001 [/127.0.0.1] failed: Connection refused: connect,Thread Group 1-3,text,false,,2594,0,6,6,http://127.0.0.1:1001/hello,0,0,0
1648953263804,1,HTTP Request,Non HTTP response code: org.apache.http.conn.HttpHostConnectException,Non HTTP response message: Connect to 127.0.0.1:1001 [/127.0.0.1] failed: Connection refused: connect,Thread Group 1-2,text,false,,2594,0,7,7,http://127.0.0.1:1001/hello,0,0,1
1648953263860,2,HTTP Request,Non HTTP response code: org.apache.http.conn.HttpHostConnectException,Non HTTP response message: Connect to 127.0.0.1:1001 [/127.0.0.1] failed: Connection refused: connect,Thread Group 1-4,text,false,,2594,0,7,7,http://127.0.0.1:1001/hello,0,0,2
1648953263883,2,HTTP Request,Non HTTP response code: org.apache.http.conn.HttpHostConnectException,Non HTTP response message: Connect to 127.0.0.1:1001 [/127.0.0.1] failed: Connection refused: connect,Thread Group 1-1,text,false,,2594,0,7,7,http://127.0.0.1:1001/hello,0,0,2
1648953264702,1,HTTP Request,Non HTTP response code: org.apache.http.conn.HttpHostConnectException,Non HTTP response message: Connect to 127.0.0.1:1001 [/127.0.0.1] failed: Connection refused: connect,Thread Group 1-6,text,false,,2594,0,7,7,http://127.0.0.1:1001/hello,0,0,1
1648953264704,2,HTTP Request,Non HTTP response code: org.apache.http.conn.HttpHostConnectException,Non HTTP response message: Connect to 127.0.0.1:1001 [/127.0.0.1] failed: Connection refused: connect,Thread Group 1-5,text,false,,2594,0,7,7,http://127.0.0.1:1001/hello,0,0,2
1648953264750,1,HTTP Request,Non HTTP response code: org.apache.http.conn.HttpHostConnectException,Non HTTP response message: Connect to 127.0.0.1:1001 [/127.0.0.1] failed: Connection refused: connect,Thread Group 1-7,text,false,,2594,0,7,7,http://127.0.0.1:1001/hello,0,0,1
1648953264771,1,HTTP Request,Non HTTP response code: org.apache.http.conn.HttpHostConnectException,Non HTTP response message: Connect to 127.0.0.1:1001 [/127.0.0.1] failed: Connection refused: connect,Thread Group 1-2,text,false,,2594,0,7,7,http://127.0.0.1:1001/hello,0,0,1
1648953264777,2,HTTP Request,Non HTTP response code: org.apache.http.conn.HttpHostConnectException,Non HTTP response message: Connect to 127.0.0.1:1001 [/127.0.0.1] failed: Connection refused: connect,Thread Group 1-3,text,false,,2594,0,7,7,http://127.0.0.1:1001/hello,0,0,2
1648953264846,1,HTTP Request,Non HTTP response code: org.apache.http.conn.HttpHostConnectException,Non HTTP response message: Connect to 127.0.0.1:1001 [/127.0.0.1] failed: Connection refused: connect,Thread Group 1-1,text,false,,2594,0,8,8,http://127.0.0.1:1001/hello,0,0,1
1648953264856,0,HTTP Request,Non HTTP response code: org.apache.http.conn.HttpHostConnectException,Non HTTP response message: Connect to 127.0.0.1:1001 [/127.0.0.1] failed: Connection refused: connect,Thread Group 1-4,text,false,,2594,0,8,8,http://127.0.0.1:1001/hello,0,0,0
1648953265697,1,HTTP Request,Non HTTP response code: org.apache.http.conn.HttpHostConnectException,Non HTTP response message: Connect to 127.0.0.1:1001 [/127.0.0.1] failed: Connection refused: connect,Thread Group 1-5,text,false,,2594,0,8,8,http://127.0.0.1:1001/hello,0,0,1
1648953265739,1,HTTP Request,Non HTTP response code: org.apache.http.conn.HttpHostConnectException,Non HTTP response message: Connect to 127.0.0.1:1001 [/127.0.0.1] failed: Connection refused: connect,Thread Group 1-6,text,false,,2594,0,8,8,http://127.0.0.1:1001/hello,0,0,1
1648953265777,1,HTTP Request,Non HTTP response code: org.apache.http.conn.HttpHostConnectException,Non HTTP response message: Connect to 127.0.0.1:1001 [/127.0.0.1] failed: Connection refused: connect,Thread Group 1-7,text,false,,2594,0,8,8,http://127.0.0.1:1001/hello,0,0,0
1648953265792,1,HTTP Request,Non HTTP response code: org.apache.http.conn.HttpHostConnectException,Non HTTP response message: Connect to 127.0.0.1:1001 [/127.0.0.1] failed: Connection refused: connect,Thread Group 1-2,text,false,,2594,0,8,8,http://127.0.0.1:1001/hello,0,0,0
1648953265801,1,HTTP Request,Non HTTP response code: org.apache.http.conn.HttpHostConnectException,Non HTTP response message: Connect to 127.0.0.1:1001 [/127.0.0.1] failed: Connection refused: connect,Thread Group 1-8,text,false,,2594,0,9,9,http://127.0.0.1:1001/hello,0,0,1
1648953265856,1,HTTP Request,Non HTTP response code: org.apache.http.conn.HttpHostConnectException,Non HTTP response message: Connect to 127.0.0.1:1001 [/127.0.0.1] failed: Connection refused: connect,Thread Group 1-3,text,false,,2594,0,9,9,http://127.0.0.1:1001/hello,0,0,1
1648953265867,1,HTTP Request,Non HTTP response code: org.apache.http.conn.HttpHostConnectException,Non HTTP response message: Connect to 127.0.0.1:1001 [/127.0.0.1] failed: Connection refused: connect,Thread Group 1-1,text,false,,2594,0,9,9,http://127.0.0.1:1001/hello,0,0,1
1648953265874,0,HTTP Request,Non HTTP response code: org.apache.http.conn.HttpHostConnectException,Non HTTP response message: Connect to 127.0.0.1:1001 [/127.0.0.1] failed: Connection refused: connect,Thread Group 1-4,text,false,,2594,0,9,9,http://127.0.0.1:1001/hello,0,0,0
1648953266706,1,HTTP Request,Non HTTP response code: org.apache.http.conn.HttpHostConnectException,Non HTTP response message: Connect to 127.0.0.1:1001 [/127.0.0.1] failed: Connection refused: connect,Thread Group 1-5,text,false,,2594,0,9,9,http://127.0.0.1:1001/hello,0,0,1
1648953266759,1,HTTP Request,Non HTTP response code: org.apache.http.conn.HttpHostConnectException,Non HTTP response message: Connect to 127.0.0.1:1001 [/127.0.0.1] failed: Connection refused: connect,Thread Group 1-6,text,false,,2594,0,9,9,http://127.0.0.1:1001/hello,0,0,1
1648953266762,1,HTTP Request,Non HTTP response code: org.apache.http.conn.HttpHostConnectException,Non HTTP response message: Connect to 127.0.0.1:1001 [/127.0.0.1] failed: Connection refused: connect,Thread Group 1-7,text,false,,2594,0,9,9,http://127.0.0.1:1001/hello,0,0,1
1648953266790,1,HTTP Request,Non HTTP response code: org.apache.http.conn.HttpHostConnectException,Non HTTP response message: Connect to 127.0.0.1:1001 [/127.0.0.1] failed: Connection refused: connect,Thread Group 1-8,text,false,,2594,0,9,9,http://127.0.0.1:1001/hello,0,0,1
1648953266793,1,HTTP Request,Non HTTP response code: org.apache.http.conn.HttpHostConnectException,Non HTTP response message: Connect to 127.0.0.1:1001 [/127.0.0.1] failed: Connection refused: connect,Thread Group 1-9,text,false,,2594,0,10,10,http://127.0.0.1:1001/hello,0,0,0
1648953266835,1,HTTP Request,Non HTTP response code: org.apache.http.conn.HttpHostConnectException,Non HTTP response message: Connect to 127.0.0.1:1001 [/127.0.0.1] failed: Connection refused: connect,Thread Group 1-2,text,false,,2594,0,10,10,http://127.0.0.1:1001/hello,0,0,1
1648953266847,1,HTTP Request,Non HTTP response code: org.apache.http.conn.HttpHostConnectException,Non HTTP response message: Connect to 127.0.0.1:1001 [/127.0.0.1] failed: Connection refused: connect,Thread Group 1-3,text,false,,2594,0,10,10,http://127.0.0.1:1001/hello,0,0,1
1648953266849,0,HTTP Request,Non HTTP response code: org.apache.http.conn.HttpHostConnectException,Non HTTP response message: Connect to 127.0.0.1:1001 [/127.0.0.1] failed: Connection refused: connect,Thread Group 1-4,text,false,,2594,0,10,10,http://127.0.0.1:1001/hello,0,0,0
1648953266886,1,HTTP Request,Non HTTP response code: org.apache.http.conn.HttpHostConnectException,Non HTTP response message: Connect to 127.0.0.1:1001 [/127.0.0.1] failed: Connection refused: connect,Thread Group 1-1,text,false,,2594,0,10,10,http://127.0.0.1:1001/hello,0,0,1
1648953267705,2,HTTP Request,Non HTTP response code: org.apache.http.conn.HttpHostConnectException,Non HTTP response message: Connect to 127.0.0.1:1001 [/127.0.0.1] failed: Connection refused: connect,Thread Group 1-5,text,false,,2594,0,10,10,http://127.0.0.1:1001/hello,0,0,2
1648953267732,1,HTTP Request,Non HTTP response code: org.apache.http.conn.HttpHostConnectException,Non HTTP response message: Connect to 127.0.0.1:1001 [/127.0.0.1] failed: Connection refused: connect,Thread Group 1-7,text,false,,2594,0,10,10,http://127.0.0.1:1001/hello,0,0,1
1648953267790,1,HTTP Request,Non HTTP response code: org.apache.http.conn.HttpHostConnectException,Non HTTP response message: Connect to 127.0.0.1:1001 [/127.0.0.1] failed: Connection refused: connect,Thread Group 1-8,text,false,,2594,0,10,10,http://127.0.0.1:1001/hello,0,0,1
1648953267793,1,HTTP Request,Non HTTP response code: org.apache.http.conn.HttpHostConnectException,Non HTTP response message: Connect to 127.0.0.1:1001 [/127.0.0.1] failed: Connection refused: connect,Thread Group 1-9,text,false,,2594,0,10,10,http://127.0.0.1:1001/hello,0,0,1
1648953267803,2,HTTP Request,Non HTTP response code: org.apache.http.conn.HttpHostConnectException,Non HTTP response message: Connect to 127.0.0.1:1001 [/127.0.0.1] failed: Connection refused: connect,Thread Group 1-10,text,false,,2594,0,10,10,http://127.0.0.1:1001/hello,0,0,2
1648953267806,2,HTTP Request,Non HTTP response code: org.apache.http.conn.HttpHostConnectException,Non HTTP response message: Connect to 127.0.0.1:1001 [/127.0.0.1] failed: Connection refused: connect,Thread Group 1-2,text,false,,2594,0,10,10,http://127.0.0.1:1001/hello,0,0,2
1648953267827,1,HTTP Request,Non HTTP response code: org.apache.http.conn.HttpHostConnectException,Non HTTP response message: Connect to 127.0.0.1:1001 [/127.0.0.1] failed: Connection refused: connect,Thread Group 1-6,text,false,,2594,0,10,10,http://127.0.0.1:1001/hello,0,0,1
1648953267859,1,HTTP Request,Non HTTP response code: org.apache.http.conn.HttpHostConnectException,Non HTTP response message: Connect to 127.0.0.1:1001 [/127.0.0.1] failed: Connection refused: connect,Thread Group 1-3,text,false,,2594,0,10,10,http://127.0.0.1:1001/hello,0,0,1
1648953267866,1,HTTP Request,Non HTTP response code: org.apache.http.conn.HttpHostConnectException,Non HTTP response message: Connect to 127.0.0.1:1001 [/127.0.0.1] failed: Connection refused: connect,Thread Group 1-4,text,false,,2594,0,10,10,http://127.0.0.1:1001/hello,0,0,1
1648953267872,2,HTTP Request,Non HTTP response code: org.apache.http.conn.HttpHostConnectException,Non HTTP response message: Connect to 127.0.0.1:1001 [/127.0.0.1] failed: Connection refused: connect,Thread Group 1-1,text,false,,2594,0,10,10,http://127.0.0.1:1001/hello,0,0,2
1648953268729,2,HTTP Request,Non HTTP response code: org.apache.http.conn.HttpHostConnectException,Non HTTP response message: Connect to 127.0.0.1:1001 [/127.0.0.1] failed: Connection refused: connect,Thread Group 1-9,text,false,,2594,0,9,9,http://127.0.0.1:1001/hello,0,0,2
1648953268732,2,HTTP Request,Non HTTP response code: org.apache.http.conn.HttpHostConnectException,Non HTTP response message: Connect to 127.0.0.1:1001 [/127.0.0.1] failed: Connection refused: connect,Thread Group 1-7,text,false,,2594,0,9,9,http://127.0.0.1:1001/hello,0,0,2
1648953268742,2,HTTP Request,Non HTTP response code: org.apache.http.conn.HttpHostConnectException,Non HTTP response message: Connect to 127.0.0.1:1001 [/127.0.0.1] failed: Connection refused: connect,Thread Group 1-8,text,false,,2594,0,9,9,http://127.0.0.1:1001/hello,0,0,2
1648953268743,1,HTTP Request,Non HTTP response code: org.apache.http.conn.HttpHostConnectException,Non HTTP response message: Connect to 127.0.0.1:1001 [/127.0.0.1] failed: Connection refused: connect,Thread Group 1-5,text,false,,2594,0,9,9,http://127.0.0.1:1001/hello,0,0,1
1648953268792,1,HTTP Request,Non HTTP response code: org.apache.http.conn.HttpHostConnectException,Non HTTP response message: Connect to 127.0.0.1:1001 [/127.0.0.1] failed: Connection refused: connect,Thread Group 1-10,text,false,,2594,0,9,9,http://127.0.0.1:1001/hello,0,0,1
1648953268793,2,HTTP Request,Non HTTP response code: org.apache.http.conn.HttpHostConnectException,Non HTTP response message: Connect to 127.0.0.1:1001 [/127.0.0.1] failed: Connection refused: connect,Thread Group 1-2,text,false,,2594,0,9,9,http://127.0.0.1:1001/hello,0,0,2
1648953268817,1,HTTP Request,Non HTTP response code: org.apache.http.conn.HttpHostConnectException,Non HTTP response message: Connect to 127.0.0.1:1001 [/127.0.0.1] failed: Connection refused: connect,Thread Group 1-6,text,false,,2594,0,8,8,http://127.0.0.1:1001/hello,0,0,1
1648953268818,1,HTTP Request,Non HTTP response code: org.apache.http.conn.HttpHostConnectException,Non HTTP response message: Connect to 127.0.0.1:1001 [/127.0.0.1] failed: Connection refused: connect,Thread Group 1-3,text,false,,2594,0,8,8,http://127.0.0.1:1001/hello,0,0,1
1648953268843,2,HTTP Request,Non HTTP response code: org.apache.http.conn.HttpHostConnectException,Non HTTP response message: Connect to 127.0.0.1:1001 [/127.0.0.1] failed: Connection refused: connect,Thread Group 1-4,text,false,,2594,0,8,8,http://127.0.0.1:1001/hello,0,0,2
1648953269737,2,HTTP Request,Non HTTP response code: org.apache.http.conn.HttpHostConnectException,Non HTTP response message: Connect to 127.0.0.1:1001 [/127.0.0.1] failed: Connection refused: connect,Thread Group 1-9,text,false,,2594,0,8,8,http://127.0.0.1:1001/hello,0,0,2
1648953269751,1,HTTP Request,Non HTTP response code: org.apache.http.conn.HttpHostConnectException,Non HTTP response message: Connect to 127.0.0.1:1001 [/127.0.0.1] failed: Connection refused: connect,Thread Group 1-8,text,false,,2594,0,8,8,http://127.0.0.1:1001/hello,0,0,1
1648953269779,2,HTTP Request,Non HTTP response code: org.apache.http.conn.HttpHostConnectException,Non HTTP response message: Connect to 127.0.0.1:1001 [/127.0.0.1] failed: Connection refused: connect,Thread Group 1-7,text,false,,2594,0,8,8,http://127.0.0.1:1001/hello,0,0,1
1648953269787,0,HTTP Request,Non HTTP response code: org.apache.http.conn.HttpHostConnectException,Non HTTP response message: Connect to 127.0.0.1:1001 [/127.0.0.1] failed: Connection refused: connect,Thread Group 1-10,text,false,,2594,0,8,8,http://127.0.0.1:1001/hello,0,0,0
1648953269811,2,HTTP Request,Non HTTP response code: org.apache.http.conn.HttpHostConnectException,Non HTTP response message: Connect to 127.0.0.1:1001 [/127.0.0.1] failed: Connection refused: connect,Thread Group 1-6,text,false,,2594,0,8,8,http://127.0.0.1:1001/hello,0,0,2
1648953269814,2,HTTP Request,Non HTTP response code: org.apache.http.conn.HttpHostConnectException,Non HTTP response message: Connect to 127.0.0.1:1001 [/127.0.0.1] failed: Connection refused: connect,Thread Group 1-3,text,false,,2594,0,8,8,http://127.0.0.1:1001/hello,0,0,2
1648953269818,2,HTTP Request,Non HTTP response code: org.apache.http.conn.HttpHostConnectException,Non HTTP response message: Connect to 127.0.0.1:1001 [/127.0.0.1] failed: Connection refused: connect,Thread Group 1-5,text,false,,2594,0,7,7,http://127.0.0.1:1001/hello,0,0,2
1648953269846,2,HTTP Request,Non HTTP response code: org.apache.http.conn.HttpHostConnectException,Non HTTP response message: Connect to 127.0.0.1:1001 [/127.0.0.1] failed: Connection refused: connect,Thread Group 1-4,text,false,,2594,0,7,7,http://127.0.0.1:1001/hello,0,0,2
1648953270742,1,HTTP Request,Non HTTP response code: org.apache.http.conn.HttpHostConnectException,Non HTTP response message: Connect to 127.0.0.1:1001 [/127.0.0.1] failed: Connection refused: connect,Thread Group 1-8,text,false,,2594,0,7,7,http://127.0.0.1:1001/hello,0,0,1
1648953270768,2,HTTP Request,Non HTTP response code: org.apache.http.conn.HttpHostConnectException,Non HTTP response message: Connect to 127.0.0.1:1001 [/127.0.0.1] failed: Connection refused: connect,Thread Group 1-9,text,false,,2594,0,7,7,http://127.0.0.1:1001/hello,0,0,2
1648953270777,1,HTTP Request,Non HTTP response code: org.apache.http.conn.HttpHostConnectException,Non HTTP response message: Connect to 127.0.0.1:1001 [/127.0.0.1] failed: Connection refused: connect,Thread Group 1-5,text,false,,2594,0,7,7,http://127.0.0.1:1001/hello,0,0,1
1648953270783,0,HTTP Request,Non HTTP response code: org.apache.http.conn.HttpHostConnectException,Non HTTP response message: Connect to 127.0.0.1:1001 [/127.0.0.1] failed: Connection refused: connect,Thread Group 1-6,text,false,,2594,0,7,7,http://127.0.0.1:1001/hello,0,0,0
1648953270787,1,HTTP Request,Non HTTP response code: org.apache.http.conn.HttpHostConnectException,Non HTTP response message: Connect to 127.0.0.1:1001 [/127.0.0.1] failed: Connection refused: connect,Thread Group 1-10,text,false,,2594,0,7,7,http://127.0.0.1:1001/hello,0,0,1
1648953270791,1,HTTP Request,Non HTTP response code: org.apache.http.conn.HttpHostConnectException,Non HTTP response message: Connect to 127.0.0.1:1001 [/127.0.0.1] failed: Connection refused: connect,Thread Group 1-7,text,false,,2594,0,7,7,http://127.0.0.1:1001/hello,0,0,1
1648953270858,1,HTTP Request,Non HTTP response code: org.apache.http.conn.HttpHostConnectException,Non HTTP response message: Connect to 127.0.0.1:1001 [/127.0.0.1] failed: Connection refused: connect,Thread Group 1-4,text,false,,2594,0,7,7,http://127.0.0.1:1001/hello,0,0,1
1648953271737,2,HTTP Request,Non HTTP response code: org.apache.http.conn.HttpHostConnectException,Non HTTP response message: Connect to 127.0.0.1:1001 [/127.0.0.1] failed: Connection refused: connect,Thread Group 1-8,text,false,,2594,0,6,6,http://127.0.0.1:1001/hello,0,0,2
1648953271747,1,HTTP Request,Non HTTP response code: org.apache.http.conn.HttpHostConnectException,Non HTTP response message: Connect to 127.0.0.1:1001 [/127.0.0.1] failed: Connection refused: connect,Thread Group 1-5,text,false,,2594,0,6,6,http://127.0.0.1:1001/hello,0,0,1
1648953271760,2,HTTP Request,Non HTTP response code: org.apache.http.conn.HttpHostConnectException,Non HTTP response message: Connect to 127.0.0.1:1001 [/127.0.0.1] failed: Connection refused: connect,Thread Group 1-7,text,false,,2594,0,5,5,http://127.0.0.1:1001/hello,0,0,2
1648953271772,1,HTTP Request,Non HTTP response code: org.apache.http.conn.HttpHostConnectException,Non HTTP response message: Connect to 127.0.0.1:1001 [/127.0.0.1] failed: Connection refused: connect,Thread Group 1-6,text,false,,2594,0,5,5,http://127.0.0.1:1001/hello,0,0,1
1648953271787,1,HTTP Request,Non HTTP response code: org.apache.http.conn.HttpHostConnectException,Non HTTP response message: Connect to 127.0.0.1:1001 [/127.0.0.1] failed: Connection refused: connect,Thread Group 1-10,text,false,,2594,0,5,5,http://127.0.0.1:1001/hello,0,0,1
1648953271791,1,HTTP Request,Non HTTP response code: org.apache.http.conn.HttpHostConnectException,Non HTTP response message: Connect to 127.0.0.1:1001 [/127.0.0.1] failed: Connection refused: connect,Thread Group 1-9,text,false,,2594,0,5,5,http://127.0.0.1:1001/hello,0,0,1
1648953272738,1,HTTP Request,Non HTTP response code: org.apache.http.conn.HttpHostConnectException,Non HTTP response message: Connect to 127.0.0.1:1001 [/127.0.0.1] failed: Connection refused: connect,Thread Group 1-8,text,false,,2594,0,5,5,http://127.0.0.1:1001/hello,0,0,1
1648953272768,1,HTTP Request,Non HTTP response code: org.apache.http.conn.HttpHostConnectException,Non HTTP response message: Connect to 127.0.0.1:1001 [/127.0.0.1] failed: Connection refused: connect,Thread Group 1-9,text,false,,2594,0,5,5,http://127.0.0.1:1001/hello,0,0,1
1648953272788,2,HTTP Request,Non HTTP response code: org.apache.http.conn.HttpHostConnectException,Non HTTP response message: Connect to 127.0.0.1:1001 [/127.0.0.1] failed: Connection refused: connect,Thread Group 1-7,text,false,,2594,0,5,5,http://127.0.0.1:1001/hello,0,0,2
1648953272791,1,HTTP Request,Non HTTP response code: org.apache.http.conn.HttpHostConnectException,Non HTTP response message: Connect to 127.0.0.1:1001 [/127.0.0.1] failed: Connection refused: connect,Thread Group 1-10,text,false,,2594,0,5,5,http://127.0.0.1:1001/hello,0,0,1
1648953272810,1,HTTP Request,Non HTTP response code: org.apache.http.conn.HttpHostConnectException,Non HTTP response message: Connect to 127.0.0.1:1001 [/127.0.0.1] failed: Connection refused: connect,Thread Group 1-6,text,false,,2594,0,5,5,http://127.0.0.1:1001/hello,0,0,1
1648953273736,2,HTTP Request,Non HTTP response code: org.apache.http.conn.HttpHostConnectException,Non HTTP response message: Connect to 127.0.0.1:1001 [/127.0.0.1] failed: Connection refused: connect,Thread Group 1-10,text,false,,2594,0,4,4,http://127.0.0.1:1001/hello,0,0,1
1648953273761,2,HTTP Request,Non HTTP response code: org.apache.http.conn.HttpHostConnectException,Non HTTP response message: Connect to 127.0.0.1:1001 [/127.0.0.1] failed: Connection refused: connect,Thread Group 1-8,text,false,,2594,0,4,4,http://127.0.0.1:1001/hello,0,0,1
1648953273772,1,HTTP Request,Non HTTP response code: org.apache.http.conn.HttpHostConnectException,Non HTTP response message: Connect to 127.0.0.1:1001 [/127.0.0.1] failed: Connection refused: connect,Thread Group 1-9,text,false,,2594,0,4,4,http://127.0.0.1:1001/hello,0,0,1
1648953273808,1,HTTP Request,Non HTTP response code: org.apache.http.conn.HttpHostConnectException,Non HTTP response message: Connect to 127.0.0.1:1001 [/127.0.0.1] failed: Connection refused: connect,Thread Group 1-7,text,false,,2594,0,4,4,http://127.0.0.1:1001/hello,0,0,1
1648953274798,2,HTTP Request,Non HTTP response code: org.apache.http.conn.HttpHostConnectException,Non HTTP response message: Connect to 127.0.0.1:1001 [/127.0.0.1] failed: Connection refused: connect,Thread Group 1-9,text,false,,2594,0,3,3,http://127.0.0.1:1001/hello,0,0,2
1648953274800,1,HTTP Request,Non HTTP response code: org.apache.http.conn.HttpHostConnectException,Non HTTP response message: Connect to 127.0.0.1:1001 [/127.0.0.1] failed: Connection refused: connect,Thread Group 1-10,text,false,,2594,0,3,3,http://127.0.0.1:1001/hello,0,0,1
1648953274804,1,HTTP Request,Non HTTP response code: org.apache.http.conn.HttpHostConnectException,Non HTTP response message: Connect to 127.0.0.1:1001 [/127.0.0.1] failed: Connection refused: connect,Thread Group 1-8,text,false,,2594,0,3,3,http://127.0.0.1:1001/hello,0,0,1
1648953275796,1,HTTP Request,Non HTTP response code: org.apache.http.conn.HttpHostConnectException,Non HTTP response message: Connect to 127.0.0.1:1001 [/127.0.0.1] failed: Connection refused: connect,Thread Group 1-9,text,false,,2594,0,2,2,http://127.0.0.1:1001/hello,0,0,1
1648953275831,1,HTTP Request,Non HTTP response code: org.apache.http.conn.HttpHostConnectException,Non HTTP response message: Connect to 127.0.0.1:1001 [/127.0.0.1] failed: Connection refused: connect,Thread Group 1-10,text,false,,2594,0,1,1,http://127.0.0.1:1001/hello,0,0,1
1648953276817,1,HTTP Request,Non HTTP response code: org.apache.http.conn.HttpHostConnectException,Non HTTP response message: Connect to 127.0.0.1:1001 [/127.0.0.1] failed: Connection refused: connect,Thread Group 1-10,text,false,,2594,0,1,1,http://127.0.0.1:1001/hello,0,0,1
