[
  {
    "id": 1,
    "name": "M-Tac штани Aggressor Gen Flex Army",
    "price": 2646,
    "imageUrl": "https://killa.com.ua/image/cache/catalog/image/cache/catalog/import_new/m-tac-bryuki-aggressor-gen-ii-flex-army-olive/170ee5bfbc6be9874ca77e56f57b7b73-800x800.webp",
    "article": "20058062",
    "color": "Олива"
  },
  {
    "id": 2,
    "name": "M-Tac штани Aggressor Summer Flex",
    "price": 3583,
    "imageUrl": "https://killa.com.ua/image/cache/catalog/image/cache/catalog/import_new/m-tac-bryuki-aggressor-summer-flex-black/c929c6b670a9753f4b44696de31b51c4-800x800.webp",
    "article": "20073002",
    "color": "Чорний"
    },
  {
    "id": 3,
    "name": "M-Tac штани Aggressor Summer Flex",
    "price": 3583,
    "imageUrl": "https://killa.com.ua/image/cache/catalog/image/cache/catalog/import_new/m-tac-bryuki-aggressor-summer-flex-coyote/M-TAC%20ShTANI%20AGGRESSOR%20SUMMER%20FLEX%20COYOTE-800x800.webp",
    "article": "20073005",
    "color": "Койот"
  },
  {
    "id": 4,
    "name": "M-Tac сорочка бойова літня MM14",
    "price": 2976,
    "imageUrl": "https://killa.com.ua/image/cache/catalog/import_new/m-tac-rubashka-boevaya-letnyaya-mm14/63thwg41cufo3x2nh992m3908kcakwgi-800x800.jpg",
    "article": "20473030",
    "color": "Олива-Мультикам"
  },
  {
    "id": 5,
    "name": "M-Tac черевики польові Mk.2 R Gen.II",
    "price": 3536,
    "imageUrl": "https://killa.com.ua/image/cache/catalog/image/cache/catalog/import_new/m-tac-botinki-polevye-mk2-r-genii-coyote-brown/73d69f07451d2e3518f0d4cae26e5dff-800x800.webp",
    "article": "30003817",
    "color": "Койот"
  },
  {
    "id": 6,
    "name": "M-Tac куртка Alpha Microfleece Gen.II",
    "price": 2287,
    "imageUrl": "https://killa.com.ua/image/cache/catalog/image/cache/catalog/import_new/m-tac-kurtka-alpha-microfleece-genii-dark-olive/20411048-800x800.webp",
    "article": "20411048",
    "color": "Олива"
  },
  {
    "id": 7,
    "name": "M-Tac штани Aggressor Gen II Flex",
    "price": 2446,
    "imageUrl": "https://killa.com.ua/image/cache/catalog/image/cache/catalog/import_new/m-tac-bryuki-aggressor-gen-ii-flex-black/337dd56b910de4bdf82c7aa1be06759d-800x800.webp",
    "article": "20058002",
    "color": "Чорний"
  },
  {
    "id": 8,
    "name": "M-Tac штани Conquistador Gen I Flex",
    "price": 2646,
    "imageUrl": "https://killa.com.ua/image/cache/catalog/image/cache/catalog/import_new/m-tac-bryuki-conquistador-gen-i-flex-coyote-brown/M-TAC%20ShTANI%20CONQUISTADOR%20GEN%20I%20FLEX%20COYOTE%20BROWN-800x800.webp",
    "article": "20059017",
    "color": "Коричневий"
  },
  {
    "id": 9,
    "name": "M-Tac штани Soft Shell Winter",
    "price": 1767,
    "imageUrl": "https://killa.com.ua/image/cache/catalog/image/cache/catalog/import_new/m-tac-bryuki-soft-shell-winter-olive/M-TAC%20ShTANI%20SOFT%20SHELL%20WINTER%20OLIVE-800x800.webp",
    "article": "20306001",
    "color": "Олива"
    },
  {
    "id": 10,
    "name": "M-Tac штани Aggressor Summer Flex",
    "price": 3583,
    "imageUrl": "https://killa.com.ua/image/cache/catalog/image/cache/catalog/import_new/m-tac-bryuki-aggressor-summer-flex-coyote/M-TAC%20ShTANI%20AGGRESSOR%20SUMMER%20FLEX%20COYOTE-800x800.webp",
    "article": "20073005",
    "color": "Койот"
  },
  {
    "id": 11,
    "name": "Тактичні рукавиці Mechanix The Original®",
    "price": 1559,
    "imageUrl": "https://killa.com.ua/image/cache/catalog/image/cache/catalog/import_new/takticheskie-perchatki-mechanix-the-original-multicam/27043571554368_%20c8906f4332-800x800.webp",
    "article": "20073007",
    "color": "Мультикам"
  },
  {
    "id": 12,
    "name": "M-Tac рюкзак Mission Pack Laser Cut",
    "price": 2591,
    "imageUrl": "https://killa.com.ua/image/cache/catalog/image/cache/catalog/import_new/m-tac-ryukzak-mission-pack-laser-cut-coyote/965b15793ba82e6626fba914ab157104-800x800.webp",
    "article": "10323003",
    "color": "Койот"
  },
  {
    "id": 14,
    "name": "M-Tac рюкзак Large Assault Pack Tan",
    "price": 1571,
    "imageUrl": "https://killa.com.ua/image/cache/catalog/image/cache/catalog/import_new/m-tac-ryukzak-large-assault-pack-tan/a618d8a6457b0e51681776671b321a33-800x800.webp",
    "article": "10334003",
    "color": "Олива"
  },
  {
    "id": 15,
    "name": "Футболка TACTICAL - TopCool",
    "price": 795,
    "imageUrl": "https://killa.com.ua/image/cache/catalog/image/cache/catalog/products/2024/03/261733/1-800x800.webp",
    "article": "H3247",
    "color": "Темна-Олива"
  },
  {
    "id": 16,
    "name": "M-Tac поло ЗСУ 65/35 ",
    "price": 992,
    "imageUrl": "https://killa.com.ua/image/cache/catalog/image/cache/catalog/import_new/m-tac-polo-zsu-6535-dark-olive/d2f839687a5fa86091dfe53f607bfac7-800x600-800x800.webp",
    "article": "80037048",
    "color": "Темна-Олива"
  }
]
