{
	"sections": {
		"cart-items": {
			"type": "main-cart-items"
		},
		"cart-footer": {
			"type": "main-cart-footer"
		},
		"featured-products": {
			"type": "featured-collection"
		}
	},
	"order": [
		"cart-items",
		"cart-footer",
		"featured-products"
	]
}