{
	"sections": {
		"image_banner": {
			"type": "image-banner"
		},
		"rich_text": {
			"type": "rich-text"
		},
		"featured_products": {
			"type": "featured-collection"
		},
		"collage": {
			"type": "collage"
		},
		"video": {
			"type": "video"
		},
		"multi_column": {
			"type": "multicolumn"
		}
	},
	"order": [
		"image_banner",
		"rich_text",
		"featured_products",
		"collage",
		"video",
		"multi_column"
	]
}