{
  "type": "Collection",
  "id": "california_landfire_try",
  "stac_version": "1.0.0",
  "description": "Fuel types California map from Landfire",
  "links": [
    {
      "rel": "root",
      "href": "./collection.json",
      "type": "application/json"
    },
    {
      "rel": "child",
      "href": "./california_landfire_2022/collection.json",
      "type": "application/json"
    }
  ],
  "stac_extensions": [],
  "extent": {
    "spatial": {
      "bbox": [
        [
          -125.0863037339109,
          31.419048051278583,
          -113.80389292372254,
          43.47953263024537
        ]
      ]
    },
    "temporal": {
      "interval": [
        [
          "2022-01-01T00:00:00Z",
          "2022-01-01T00:00:00Z"
        ]
      ]
    }
  },
  "license": "proprietary"
}