{
  "type": "Collection",
  "id": "california_landfire_2022",
  "stac_version": "1.0.0",
  "description": "Fuel types California map 2022 from Landfire",
  "links": [
    {
      "rel": "root",
      "href": "..\\collection.json",
      "type": "application/json"
    },
    {
      "rel": "item",
      "href": ".\\california_2022_part_0_0\\california_2022_part_0_0.json",
      "type": "application/json"
    },
    {
      "rel": "item",
      "href": ".\\california_2022_part_0_10000\\california_2022_part_0_10000.json",
      "type": "application/json"
    },
    {
      "rel": "item",
      "href": ".\\california_2022_part_0_20000\\california_2022_part_0_20000.json",
      "type": "application/json"
    },
    {
      "rel": "item",
      "href": ".\\california_2022_part_0_30000\\california_2022_part_0_30000.json",
      "type": "application/json"
    },
    {
      "rel": "item",
      "href": ".\\california_2022_part_0_40000\\california_2022_part_0_40000.json",
      "type": "application/json"
    },
    {
      "rel": "item",
      "href": ".\\california_2022_part_10000_0\\california_2022_part_10000_0.json",
      "type": "application/json"
    },
    {
      "rel": "item",
      "href": ".\\california_2022_part_10000_10000\\california_2022_part_10000_10000.json",
      "type": "application/json"
    },
    {
      "rel": "item",
      "href": ".\\california_2022_part_10000_20000\\california_2022_part_10000_20000.json",
      "type": "application/json"
    },
    {
      "rel": "item",
      "href": ".\\california_2022_part_10000_30000\\california_2022_part_10000_30000.json",
      "type": "application/json"
    },
    {
      "rel": "item",
      "href": ".\\california_2022_part_10000_40000\\california_2022_part_10000_40000.json",
      "type": "application/json"
    },
    {
      "rel": "item",
      "href": ".\\california_2022_part_20000_0\\california_2022_part_20000_0.json",
      "type": "application/json"
    },
    {
      "rel": "item",
      "href": ".\\california_2022_part_20000_10000\\california_2022_part_20000_10000.json",
      "type": "application/json"
    },
    {
      "rel": "item",
      "href": ".\\california_2022_part_20000_20000\\california_2022_part_20000_20000.json",
      "type": "application/json"
    },
    {
      "rel": "item",
      "href": ".\\california_2022_part_20000_30000\\california_2022_part_20000_30000.json",
      "type": "application/json"
    },
    {
      "rel": "item",
      "href": ".\\california_2022_part_20000_40000\\california_2022_part_20000_40000.json",
      "type": "application/json"
    },
    {
      "rel": "parent",
      "href": "..\\collection.json",
      "type": "application/json"
    }
  ],
  "stac_extensions": [],
  "extent": {
    "spatial": {
      "bbox": [
        [
          -125.0863037339109,
          31.419048051278583,
          -113.80389292372254,
          43.47953263024537
        ]
      ]
    },
    "temporal": {
      "interval": [
        [
          "2022-01-01T00:00:00Z",
          "2022-01-01T00:00:00Z"
        ]
      ]
    }
  },
  "license": "proprietary"
}