{
   "users" : {
      "user" : [ {
         "id" : "1124fc8c-3116-4216-97cd-29d41200b3cc",
         "locked" : false,
         "login" : "user",
         "passwordHash" : "[-63, 87, 45, 5, 66, 77, 14, -53, 42, 101, -20, 106, -126, -82, -84, -65]",
         "roleType" : "USER"
      }, {
         "id" : "96aa4d4c-b4c7-4d46-8323-2dbe89294142",
         "locked" : false,
         "login" : "admin",
         "passwordHash" : "[-89, 34, -58, 61, -72, -20, -122, 37, -81, 108, -9, 28, -72, -62, -39, 57]",
         "roleType" : "ADMIN"
      } ]
   },
   "projects" : {
      "project" : [ {
         "id" : "434c15ae-f0c5-4366-975c-4057edf11d99",
         "createDate" : "2020-04-07T18:16:03+03:00",
         "description" : "d",
         "finishDate" : "2020-03-02T03:00:00+03:00",
         "name" : "mini pro 1",
         "startDate" : "2019-12-31T03:00:00+03:00",
         "statusType" : "PLANNED",
         "userId" : "1124fc8c-3116-4216-97cd-29d41200b3cc"
      }, {
         "id" : "9305fd75-2e5c-4b42-a393-df86e8a98b52",
         "createDate" : "2020-04-10T20:03:07+03:00",
         "description" : "desc 3",
         "finishDate" : "2022-03-02T03:00:00+03:00",
         "name" : "third project 3",
         "startDate" : "2021-02-01T03:00:00+03:00",
         "statusType" : "PLANNED",
         "userId" : "96aa4d4c-b4c7-4d46-8323-2dbe89294142"
      }, {
         "id" : "e2df5a65-e6d8-4571-8c04-41703f1db15e",
         "createDate" : "2020-04-07T18:16:03+03:00",
         "description" : "desc 2 project",
         "finishDate" : "2021-03-02T03:00:00+03:00",
         "name" : "mega pro 2",
         "startDate" : "2020-01-31T03:00:00+03:00",
         "statusType" : "PLANNED",
         "userId" : "96aa4d4c-b4c7-4d46-8323-2dbe89294142"
      }, {
         "id" : "e897e3aa-148c-4591-9db4-6f40901bebe8",
         "createDate" : "2020-04-07T18:16:03+03:00",
         "description" : "desc project 1",
         "finishDate" : "2020-06-05T03:00:00+03:00",
         "name" : "demo pro 1",
         "startDate" : "2019-12-31T03:00:00+03:00",
         "statusType" : "PLANNED",
         "userId" : "96aa4d4c-b4c7-4d46-8323-2dbe89294142"
      } ]
   },
   "tasks" : {
      "task" : [ {
         "id" : "1e822f53-ee70-4fdf-add8-43f6e1ab1f93",
         "createDate" : "2020-04-07T18:16:03+03:00",
         "description" : "w",
         "finishDate" : "2020-06-05T03:00:00+03:00",
         "name" : "mini 1 task",
         "startDate" : "2020-04-03T03:00:00+03:00",
         "statusType" : "PLANNED",
         "userId" : "1124fc8c-3116-4216-97cd-29d41200b3cc"
      }, {
         "id" : "8ebe5f49-70ea-4ba0-9c5f-cc4f064c6880",
         "createDate" : "2020-04-07T18:16:03+03:00",
         "description" : "d",
         "finishDate" : "2020-03-02T03:00:00+03:00",
         "name" : "demo 2",
         "startDate" : "2019-03-02T03:00:00+03:00",
         "statusType" : "PLANNED",
         "userId" : "1124fc8c-3116-4216-97cd-29d41200b3cc"
      }, {
         "id" : "e7e7be41-4a9a-46a9-a077-b91c0b95e431",
         "createDate" : "2020-04-07T18:16:03+03:00",
         "description" : "desc 1 task",
         "finishDate" : "2020-03-02T03:00:00+03:00",
         "name" : "demo 1 task",
         "startDate" : "2019-12-31T03:00:00+03:00",
         "statusType" : "PLANNED",
         "userId" : "96aa4d4c-b4c7-4d46-8323-2dbe89294142",
         "projectId" : "e897e3aa-148c-4591-9db4-6f40901bebe8"
      }, {
         "id" : "f4cca47a-78f7-46a4-a028-c86b1c6348a9",
         "createDate" : "2020-04-07T18:16:03+03:00",
         "description" : "desc 2",
         "finishDate" : "2020-03-02T03:00:00+03:00",
         "name" : "mega task 2",
         "startDate" : "2019-12-31T03:00:00+03:00",
         "statusType" : "PLANNED",
         "userId" : "96aa4d4c-b4c7-4d46-8323-2dbe89294142"
      } ]
   }
}