%YAML 1.1
%TAG !u! tag:unity3d.com,2011:
--- !u!114 &11400000
MonoBehaviour:
  m_ObjectHideFlags: 0
  m_CorrespondingSourceObject: {fileID: 0}
  m_PrefabInstance: {fileID: 0}
  m_PrefabAsset: {fileID: 0}
  m_GameObject: {fileID: 0}
  m_Enabled: 1
  m_EditorHideFlags: 0
  m_Script: {fileID: 11500000, guid: 64023e12b04e4fb4296e6c4254b6a7dd, type: 3}
  m_Name: Potion
  m_EditorClassIdentifier: 
  recipeName: Potion
  materialNeeded:
  - name: Leaf
    amount: 2
  - name: Water
    amount: 1
  duration: 2
  prefabs: {fileID: -2249881436934342960, guid: c3137c82eaacca343adcbef59102c7f1, type: 3}
