%YAML 1.1
%TAG !u! tag:unity3d.com,2011:
--- !u!114 &11400000
MonoBehaviour:
  m_ObjectHideFlags: 0
  m_CorrespondingSourceObject: {fileID: 0}
  m_PrefabInstance: {fileID: 0}
  m_PrefabAsset: {fileID: 0}
  m_GameObject: {fileID: 0}
  m_Enabled: 1
  m_EditorHideFlags: 0
  m_Script: {fileID: 11500000, guid: a6b194f808b1af6499c93410e504af42, type: 3}
  m_Name: mainCharacter_Purple_Atlas
  m_EditorClassIdentifier: 
  atlasFile: {fileID: 4900000, guid: 7a6a9d4bcbbd85849b1c3f0291d3e691, type: 3}
  materials:
  - {fileID: 2100000, guid: a9be26ea5616db0408a85e2b2374037c, type: 2}
