{
    "name": "Global Information",
    "numberOfRequests": {
        "total": 645609,
        "ok": 640257,
        "ko": 5352
    },
    "minResponseTime": {
        "total": 9,
        "ok": 9,
        "ko": 15
    },
    "maxResponseTime": {
        "total": 56655,
        "ok": 56655,
        "ko": 42787
    },
    "meanResponseTime": {
        "total": 37228,
        "ok": 37365,
        "ko": 20844
    },
    "standardDeviation": {
        "total": 40975,
        "ok": 41230,
        "ko": 16740
    },
    "percentiles1": {
        "total": 46510,
        "ok": 46554,
        "ko": 27578
    },
    "percentiles2": {
        "total": 49568,
        "ok": 49584,
        "ko": 36852
    },
    "percentiles3": {
        "total": 52471,
        "ok": 52480,
        "ko": 39547
    },
    "percentiles4": {
        "total": 54008,
        "ok": 54014,
        "ko": 41138
    },
    "group1": {
        "name": "t < 800 ms",
        "count": 35007,
        "percentage": 5
    },
    "group2": {
        "name": "800 ms < t < 1200 ms",
        "count": 8437,
        "percentage": 1
    },
    "group3": {
        "name": "t > 1200 ms",
        "count": 596813,
        "percentage": 92
    },
    "group4": {
        "name": "failed",
        "count": 5352,
        "percentage": 1
    },
    "meanNumberOfRequestsPerSecond": {
        "total": 71.70807224376495,
        "ok": 71.1136232775197,
        "ko": 0.5944489662452506
    }
}