{
    "appConfig": {
        "application_name": "idmc-events-summarizer",
        "application_short_name": "idmc",
        "clientIdentifier": "idmc-events-summarizer",
        "clientSecret": "",
        "version": "0.0.1-rc0"
    }
}