{
    "zero_na_columns" : [
        "active_users", "active_users_female", "crates_checked_in_room",
        "check_in_operations_room", "crates_checked_out_room", "check_out_operations_room",
        "occupancy_room", "revenue_room_usd", "revenue_room", "sellingprice_increase_room",
        "survey_filled_room"
    ],
    "dfs_to_merge": [
        { "name": "company", "on": "company_id" },
        { "name": "active_users", "on": "cooling_unit_id" },
        { "name": "crates_in", "on": "cooling_unit_id" },
        { "name": "crates_out", "on": "cooling_unit_id" },
        { "name": "occupancy_room", "on": "cooling_unit_id" },
        { "name": "revenue_room", "on": "cooling_unit_id" },
        { "name": "max_surplus_room", "on": "cooling_unit_id" },
        { "name": "sellingprice_increase_room", "on": "cooling_unit_id" },
        { "name": "survey_filled_room", "on": "cooling_unit_id" }
    ]
}