;created_at;id;id_str;full_text;truncated;display_text_range;entities;metadata;source;in_reply_to_status_id;in_reply_to_status_id_str;in_reply_to_user_id;in_reply_to_user_id_str;in_reply_to_screen_name;user;geo;coordinates;place;contributors;retweeted_status;is_quote_status;retweet_count;favorite_count;favorited;retweeted;lang;possibly_sensitive;quoted_status_id;extended_entities;quoted_status_id_str;quoted_status;withheld_in_countries;withheld_scope;withheld_copyright;irrelevant
8;Fri Aug 07 03:23:02 +0000 2020;1.2915755504446E+018;1.2915755504446E+018;"This article on the failure of the ultra-high end Mall of San Juan in Puerto Rico neglects to mention that it sits where a large public housing complex used to be. The government displaced them and destroyed the complex to give it to private speculators.
https://t.co/iushBMKDSA";False;[0, 278];{'hashtags': [], 'symbols': [], 'user_mentions': [], 'urls': [{'url': 'https://t.co/iushBMKDSA', 'expanded_url': 'https://finance.yahoo.com/news/everything-went-wrong-puerto-ricos-110003479.html', 'display_url': 'finance.yahoo.com/news/everythin…', 'indices': [255, 278]}]};{'iso_language_code': 'en', 'result_type': 'recent'};"<a href=""https://mobile.twitter.com"" rel=""nofollow"">Twitter Web App</a>";;;;;;"{'id': 567727922, 'id_str': '567727922', 'name': 'midnucas el NPIólogo 🇵🇷', 'screen_name': 'midnucas', 'location': '', 'description': 'Colonial subject, not your ""fellow American."" He/él/ele/lui.', 'url': None, 'entities': {'description': {'urls': []}}, 'protected': False, 'followers_count': 1297, 'friends_count': 780, 'listed_count': 8, 'created_at': 'Tue May 01 01:23:15 +0000 2012', 'favourites_count': 77204, 'utc_offset': None, 'time_zone': None, 'geo_enabled': False, 'verified': False, 'statuses_count': 34129, 'lang': None, 'contributors_enabled': False, 'is_translator': False, 'is_translation_enabled': False, 'profile_background_color': 'C0DEED', 'profile_background_image_url': 'http://abs.twimg.com/images/themes/theme1/bg.png', 'profile_background_image_url_https': 'https://abs.twimg.com/images/themes/theme1/bg.png', 'profile_background_tile': False, 'profile_image_url': 'http://pbs.twimg.com/profile_images/1273479443583922176/OeJ-TQcd_normal.jpg', 'profile_image_url_https': 'https://pbs.twimg.com/profile_images/1273479443583922176/OeJ-TQcd_normal.jpg', 'profile_banner_url': 'https://pbs.twimg.com/profile_banners/567727922/1592456134', 'profile_link_color': '1DA1F2', 'profile_sidebar_border_color': 'C0DEED', 'profile_sidebar_fill_color': 'DDEEF6', 'profile_text_color': '333333', 'profile_use_background_image': True, 'has_extended_profile': False, 'default_profile': True, 'default_profile_image': False, 'following': False, 'follow_request_sent': False, 'notifications': False, 'translator_type': 'none'}";;;;;;False;1;7;False;False;en;False;;;;;;;;1
6;Fri Aug 07 20:24:45 +0000 2020;1.29183267559515E+018;1.29183267559515E+018;@t2hiers @Caleidoscope11 @40_head Not missing. Displaced means housing was destroyed or parents killed or separated from.;False;[34, 121];{'hashtags': [], 'symbols': [], 'user_mentions': [{'screen_name': 't2hiers', 'name': 'Tom & Teresa Hiers', 'id': 27063898, 'id_str': '27063898', 'indices': [0, 8]}, {'screen_name': 'Caleidoscope11', 'name': 'pepe’s girlfriend', 'id': 1182165383890890752, 'id_str': '1182165383890890752', 'indices': [9, 24]}, {'screen_name': '40_head', 'name': '🇺🇸 𝟜𝟘ℍ𝕖𝕒𝕕 🇺🇸 ⭐⭐⭐ 🇺🇸', 'id': 947635931590287361, 'id_str': '947635931590287361', 'indices': [25, 33]}], 'urls': []};{'iso_language_code': 'en', 'result_type': 'recent'};"<a href=""http://twitter.com/#!/download/ipad"" rel=""nofollow"">Twitter for iPad</a>";1.29182075104199E+018;1.29182075104199E+018;27063898;27063898;t2hiers;{'id': 43044815, 'id_str': '43044815', 'name': 'SHILLDRILL', 'screen_name': 'Shilldrill', 'location': '', 'description': 'Not approved by the Ministry of Safe and Accepted Speech', 'url': None, 'entities': {'description': {'urls': []}}, 'protected': False, 'followers_count': 305, 'friends_count': 632, 'listed_count': 0, 'created_at': 'Thu May 28 04:13:26 +0000 2009', 'favourites_count': 1418, 'utc_offset': None, 'time_zone': None, 'geo_enabled': False, 'verified': False, 'statuses_count': 6135, 'lang': None, 'contributors_enabled': False, 'is_translator': False, 'is_translation_enabled': False, 'profile_background_color': 'C0DEED', 'profile_background_image_url': 'http://abs.twimg.com/images/themes/theme1/bg.png', 'profile_background_image_url_https': 'https://abs.twimg.com/images/themes/theme1/bg.png', 'profile_background_tile': False, 'profile_image_url': 'http://pbs.twimg.com/profile_images/1273819655409414147/Lntfforb_normal.jpg', 'profile_image_url_https': 'https://pbs.twimg.com/profile_images/1273819655409414147/Lntfforb_normal.jpg', 'profile_banner_url': 'https://pbs.twimg.com/profile_banners/43044815/1595435711', 'profile_link_color': '1DA1F2', 'profile_sidebar_border_color': 'C0DEED', 'profile_sidebar_fill_color': 'DDEEF6', 'profile_text_color': '333333', 'profile_use_background_image': True, 'has_extended_profile': False, 'default_profile': True, 'default_profile_image': False, 'following': False, 'follow_request_sent': False, 'notifications': False, 'translator_type': 'none'};;;;;;False;1;2;False;False;en;;;;;;;;;1
12;Fri Aug 14 12:37:18 +0000 2020;1.29425175464165E+018;1.29425175464165E+018;"""Ye look the state of Israel has gradually displaced whole communities, destroyed housing complexes, forcefully appropriated property but you know what they have better formal relations with this other country that has 'Arab' in its name so this is all good now"".";False;[0, 263];{'hashtags': [], 'symbols': [], 'user_mentions': [], 'urls': []};{'iso_language_code': 'en', 'result_type': 'recent'};"<a href=""http://twitter.com/download/android"" rel=""nofollow"">Twitter for Android</a>";;;;;;{'id': 46925017, 'id_str': '46925017', 'name': 'F', 'screen_name': 'VoluntaryistWay', 'location': '', 'description': '', 'url': None, 'entities': {'description': {'urls': []}}, 'protected': False, 'followers_count': 98, 'friends_count': 376, 'listed_count': 2, 'created_at': 'Sat Jun 13 17:25:22 +0000 2009', 'favourites_count': 11834, 'utc_offset': None, 'time_zone': None, 'geo_enabled': False, 'verified': False, 'statuses_count': 13241, 'lang': None, 'contributors_enabled': False, 'is_translator': False, 'is_translation_enabled': False, 'profile_background_color': '1A1B1F', 'profile_background_image_url': 'http://abs.twimg.com/images/themes/theme9/bg.gif', 'profile_background_image_url_https': 'https://abs.twimg.com/images/themes/theme9/bg.gif', 'profile_background_tile': False, 'profile_image_url': 'http://pbs.twimg.com/profile_images/1260200459031240710/87lFBslp_normal.jpg', 'profile_image_url_https': 'https://pbs.twimg.com/profile_images/1260200459031240710/87lFBslp_normal.jpg', 'profile_link_color': '2FC2EF', 'profile_sidebar_border_color': '181A1E', 'profile_sidebar_fill_color': '252429', 'profile_text_color': '666666', 'profile_use_background_image': True, 'has_extended_profile': False, 'default_profile': False, 'default_profile_image': False, 'following': False, 'follow_request_sent': False, 'notifications': False, 'translator_type': 'none'};;;;;;False;0;0;False;False;en;;;;;;;;;1
1;Fri Aug 21 15:36:13 +0000 2020;1.2968334937885E+018;1.2968334937885E+018;"#Bangladesh: Housing for disaster #displaced pple in Cox's Bazar. ""Our home in..Kutubdia island was destroyed in the [1991] cyclone &amp; we took shelter in a coastal slum outside Cox's Bazar airport. But during high tide, this slum home also goes under water"" https://t.co/YBttMrZmq7";False;[0, 284];{'hashtags': [{'text': 'Bangladesh', 'indices': [0, 11]}, {'text': 'displaced', 'indices': [34, 44]}], 'symbols': [], 'user_mentions': [], 'urls': [{'url': 'https://t.co/YBttMrZmq7', 'expanded_url': 'https://www.wionews.com/south-asia/bangladesh-opens-complex-to-house-climate-refugees-315796', 'display_url': 'wionews.com/south-asia/ban…', 'indices': [261, 284]}]};{'iso_language_code': 'en', 'result_type': 'recent'};"<a href=""https://mobile.twitter.com"" rel=""nofollow"">Twitter Web App</a>";;;;;;{'id': 4338580455, 'id_str': '4338580455', 'name': 'Michelle Yonetani', 'screen_name': 'm_yonetani', 'location': 'Geneva, Switzerland', 'description': '#Displacement #climatechange #disaster #fragility #resilience #protection #solutions. With UNHCR on #climateaction. Own tweets.', 'url': None, 'entities': {'description': {'urls': []}}, 'protected': False, 'followers_count': 1148, 'friends_count': 607, 'listed_count': 46, 'created_at': 'Tue Dec 01 10:06:03 +0000 2015', 'favourites_count': 2667, 'utc_offset': None, 'time_zone': None, 'geo_enabled': True, 'verified': False, 'statuses_count': 4277, 'lang': None, 'contributors_enabled': False, 'is_translator': False, 'is_translation_enabled': False, 'profile_background_color': '000000', 'profile_background_image_url': 'http://abs.twimg.com/images/themes/theme1/bg.png', 'profile_background_image_url_https': 'https://abs.twimg.com/images/themes/theme1/bg.png', 'profile_background_tile': False, 'profile_image_url': 'http://pbs.twimg.com/profile_images/1012264843162849292/jV0qqnwd_normal.jpg', 'profile_image_url_https': 'https://pbs.twimg.com/profile_images/1012264843162849292/jV0qqnwd_normal.jpg', 'profile_banner_url': 'https://pbs.twimg.com/profile_banners/4338580455/1576253194', 'profile_link_color': '94D487', 'profile_sidebar_border_color': '000000', 'profile_sidebar_fill_color': '000000', 'profile_text_color': '000000', 'profile_use_background_image': False, 'has_extended_profile': False, 'default_profile': False, 'default_profile_image': False, 'following': False, 'follow_request_sent': False, 'notifications': False, 'translator_type': 'none'};;;;;;False;0;0;False;False;en;False;;;;;;;;0
34;Fri Aug 21 15:36:13 +0000 2020;1.2968334937885E+018;1.2968334937885E+018;"#Bangladesh: Housing for disaster #displaced pple in Cox's Bazar. ""Our home in..Kutubdia island was destroyed in the [1991] cyclone &amp; we took shelter in a coastal slum outside Cox's Bazar airport. But during high tide, this slum home also goes under water"" https://t.co/YBttMrZmq7";False;[0, 284];{'hashtags': [{'text': 'Bangladesh', 'indices': [0, 11]}, {'text': 'displaced', 'indices': [34, 44]}], 'symbols': [], 'user_mentions': [], 'urls': [{'url': 'https://t.co/YBttMrZmq7', 'expanded_url': 'https://www.wionews.com/south-asia/bangladesh-opens-complex-to-house-climate-refugees-315796', 'display_url': 'wionews.com/south-asia/ban…', 'indices': [261, 284]}]};{'iso_language_code': 'en', 'result_type': 'recent'};"<a href=""https://mobile.twitter.com"" rel=""nofollow"">Twitter Web App</a>";;;;;;{'id': 4338580455, 'id_str': '4338580455', 'name': 'Michelle Yonetani', 'screen_name': 'm_yonetani', 'location': 'Geneva, Switzerland', 'description': '#Displacement #climatechange #disaster #fragility #resilience #protection #solutions. With UNHCR on #climateaction. Own tweets.', 'url': None, 'entities': {'description': {'urls': []}}, 'protected': False, 'followers_count': 1152, 'friends_count': 607, 'listed_count': 46, 'created_at': 'Tue Dec 01 10:06:03 +0000 2015', 'favourites_count': 2679, 'utc_offset': None, 'time_zone': None, 'geo_enabled': True, 'verified': False, 'statuses_count': 4300, 'lang': None, 'contributors_enabled': False, 'is_translator': False, 'is_translation_enabled': False, 'profile_background_color': '000000', 'profile_background_image_url': 'http://abs.twimg.com/images/themes/theme1/bg.png', 'profile_background_image_url_https': 'https://abs.twimg.com/images/themes/theme1/bg.png', 'profile_background_tile': False, 'profile_image_url': 'http://pbs.twimg.com/profile_images/1012264843162849292/jV0qqnwd_normal.jpg', 'profile_image_url_https': 'https://pbs.twimg.com/profile_images/1012264843162849292/jV0qqnwd_normal.jpg', 'profile_banner_url': 'https://pbs.twimg.com/profile_banners/4338580455/1576253194', 'profile_link_color': '94D487', 'profile_sidebar_border_color': '000000', 'profile_sidebar_fill_color': '000000', 'profile_text_color': '000000', 'profile_use_background_image': False, 'has_extended_profile': False, 'default_profile': False, 'default_profile_image': False, 'following': False, 'follow_request_sent': False, 'notifications': False, 'translator_type': 'none'};;;;;;False;0;0;False;False;en;False;;;;;;;;0
10;Fri Jul 17 00:28:56 +0000 2020;1.28392159460431E+018;1.28392159460431E+018;@eyeonthefly Oh there is so much irony on the world. Like all the new housing developments that are named after the animal/bird they displaced. A new one on wonderland called The Nest. How many nests were destroyed in the process?   ..;False;[13, 235];{'hashtags': [], 'symbols': [], 'user_mentions': [{'screen_name': 'eyeonthefly', 'name': 'Brendon Samuels', 'id': 1039582929184337921, 'id_str': '1039582929184337921', 'indices': [0, 12]}], 'urls': []};{'iso_language_code': 'en', 'result_type': 'recent'};"<a href=""https://mobile.twitter.com"" rel=""nofollow"">Twitter Web App</a>";1.28390140913041E+018;1.28390140913041E+018;1.03958292918434E+018;1.03958292918434E+018;eyeonthefly;{'id': 1065008844802125826, 'id_str': '1065008844802125826', 'name': 'Laure Wilson Neish', 'screen_name': 'NeishLaure', 'location': '', 'description': 'birder, photographer, retired teacher', 'url': None, 'entities': {'description': {'urls': []}}, 'protected': False, 'followers_count': 26, 'friends_count': 31, 'listed_count': 0, 'created_at': 'Tue Nov 20 22:27:50 +0000 2018', 'favourites_count': 337, 'utc_offset': None, 'time_zone': None, 'geo_enabled': False, 'verified': False, 'statuses_count': 259, 'lang': None, 'contributors_enabled': False, 'is_translator': False, 'is_translation_enabled': False, 'profile_background_color': 'F5F8FA', 'profile_background_image_url': None, 'profile_background_image_url_https': None, 'profile_background_tile': False, 'profile_image_url': 'http://pbs.twimg.com/profile_images/1167956787082846208/EWQBsaUv_normal.jpg', 'profile_image_url_https': 'https://pbs.twimg.com/profile_images/1167956787082846208/EWQBsaUv_normal.jpg', 'profile_banner_url': 'https://pbs.twimg.com/profile_banners/1065008844802125826/1567297812', 'profile_link_color': '1DA1F2', 'profile_sidebar_border_color': 'C0DEED', 'profile_sidebar_fill_color': 'DDEEF6', 'profile_text_color': '333333', 'profile_use_background_image': True, 'has_extended_profile': False, 'default_profile': True, 'default_profile_image': False, 'following': False, 'follow_request_sent': False, 'notifications': False, 'translator_type': 'none'};;;;;;False;0;4;False;False;en;;;;;;;;;1
0;Fri Jul 31 07:32:11 +0000 2020;1.28910153654762E+018;1.28910153654762E+018;"“All told, Stalin and Hitler forcibly displaced some 30m people between 1941-43” ... and vast numbers “sent home” to horrible fates after the war.

40% of German housing destroyed. 

This was one huge messy cleanup job. We rarely hear about the postwar era.";False;[0, 257];{'hashtags': [], 'symbols': [], 'user_mentions': [], 'urls': []};{'iso_language_code': 'en', 'result_type': 'recent'};"<a href=""http://twitter.com/download/iphone"" rel=""nofollow"">Twitter for iPhone</a>";1.28910010597116E+018;1.28910010597116E+018;8500962;8500962;vgr;{'id': 8500962, 'id_str': '8500962', 'name': 'Venkatesh Rao', 'screen_name': 'vgr', 'location': 'Los Angeles, CA', 'description': 'This is my conversational account. For my work follow @ribbonfarm, @breaking_smart, @artofgig. Tweets are 90% vacuous views, apathetically held. Mediocritopian.', 'url': 'https://t.co/KpI7Q66b6Q', 'entities': {'url': {'urls': [{'url': 'https://t.co/KpI7Q66b6Q', 'expanded_url': 'http://venkateshrao.com/', 'display_url': 'venkateshrao.com', 'indices': [0, 23]}]}, 'description': {'urls': []}}, 'protected': False, 'followers_count': 37987, 'friends_count': 1181, 'listed_count': 1293, 'created_at': 'Wed Aug 29 02:23:32 +0000 2007', 'favourites_count': 56970, 'utc_offset': None, 'time_zone': None, 'geo_enabled': False, 'verified': False, 'statuses_count': 108112, 'lang': None, 'contributors_enabled': False, 'is_translator': False, 'is_translation_enabled': False, 'profile_background_color': '9AE4E8', 'profile_background_image_url': 'http://abs.twimg.com/images/themes/theme1/bg.png', 'profile_background_image_url_https': 'https://abs.twimg.com/images/themes/theme1/bg.png', 'profile_background_tile': True, 'profile_image_url': 'http://pbs.twimg.com/profile_images/1266600883380342785/1OFJtU3I_normal.jpg', 'profile_image_url_https': 'https://pbs.twimg.com/profile_images/1266600883380342785/1OFJtU3I_normal.jpg', 'profile_banner_url': 'https://pbs.twimg.com/profile_banners/8500962/1587693771', 'profile_link_color': '0000FF', 'profile_sidebar_border_color': '87BC44', 'profile_sidebar_fill_color': 'E9EFD7', 'profile_text_color': '000000', 'profile_use_background_image': False, 'has_extended_profile': False, 'default_profile': False, 'default_profile_image': False, 'following': False, 'follow_request_sent': False, 'notifications': False, 'translator_type': 'none'};;;;;;False;0;4;False;False;en;;;;;;;;;1
4;Mon Aug 17 02:23:15 +0000 2020;1.29518438674939E+018;1.29518438674939E+018;@wkamaubell @KosherSoul I had no idea the gov destroyed a public housing area and redeveloped the area into a high cost and unattainable housing area. Totally unfair to those displaced:(;False;[24, 186];{'hashtags': [], 'symbols': [], 'user_mentions': [{'screen_name': 'wkamaubell', 'name': 'W. Kamau Bell', 'id': 19119809, 'id_str': '19119809', 'indices': [0, 11]}, {'screen_name': 'KosherSoul', 'name': 'Michael W. Twitty', 'id': 47839975, 'id_str': '47839975', 'indices': [12, 23]}], 'urls': []};{'iso_language_code': 'en', 'result_type': 'recent'};"<a href=""http://twitter.com/download/iphone"" rel=""nofollow"">Twitter for iPhone</a>";1.29518144457105E+018;1.29518144457105E+018;19119809;19119809;wkamaubell;{'id': 19973965, 'id_str': '19973965', 'name': 'cathy owen', 'screen_name': 'angelsioux', 'location': '', 'description': '', 'url': None, 'entities': {'description': {'urls': []}}, 'protected': False, 'followers_count': 28, 'friends_count': 378, 'listed_count': 1, 'created_at': 'Tue Feb 03 14:34:29 +0000 2009', 'favourites_count': 534, 'utc_offset': None, 'time_zone': None, 'geo_enabled': False, 'verified': False, 'statuses_count': 212, 'lang': None, 'contributors_enabled': False, 'is_translator': False, 'is_translation_enabled': False, 'profile_background_color': 'C0DEED', 'profile_background_image_url': 'http://abs.twimg.com/images/themes/theme1/bg.png', 'profile_background_image_url_https': 'https://abs.twimg.com/images/themes/theme1/bg.png', 'profile_background_tile': False, 'profile_image_url': 'http://pbs.twimg.com/profile_images/641436592112963584/ufdhwALP_normal.jpg', 'profile_image_url_https': 'https://pbs.twimg.com/profile_images/641436592112963584/ufdhwALP_normal.jpg', 'profile_link_color': '1DA1F2', 'profile_sidebar_border_color': 'C0DEED', 'profile_sidebar_fill_color': 'DDEEF6', 'profile_text_color': '333333', 'profile_use_background_image': True, 'has_extended_profile': False, 'default_profile': True, 'default_profile_image': False, 'following': False, 'follow_request_sent': False, 'notifications': False, 'translator_type': 'none'};;;;;;False;0;1;False;False;en;;;;;;;;;1
33;Mon Aug 24 19:39:10 +0000 2020;1.29798179770017E+018;1.29798179770017E+018;Destroyed housing is a major obstacle to return for displaced families + it slows the recovery of affected communities. IOM #Iraq removed debris and explosive hazards from these 🏠🏠 in West #Mosul, with support from @qcharity🇶🇦. Homeowners will now receive support to rebuild! https://t.co/eZf1e1E4Jl;False;[0, 275];{'hashtags': [{'text': 'Iraq', 'indices': [124, 129]}, {'text': 'Mosul', 'indices': [189, 195]}], 'symbols': [], 'user_mentions': [{'screen_name': 'qcharity', 'name': 'Qatar Charity | قطر الخيرية', 'id': 202566660, 'id_str': '202566660', 'indices': [215, 224]}], 'urls': [], 'media': [{'id': 1297981252633612294, 'id_str': '1297981252633612294', 'indices': [276, 299], 'media_url': 'http://pbs.twimg.com/media/EgNbEoBX0AYqo4V.jpg', 'media_url_https': 'https://pbs.twimg.com/media/EgNbEoBX0AYqo4V.jpg', 'url': 'https://t.co/eZf1e1E4Jl', 'display_url': 'pic.twitter.com/eZf1e1E4Jl', 'expanded_url': 'https://twitter.com/IOMIraq/status/1297981797700173825/photo/1', 'type': 'photo', 'sizes': {'small': {'w': 680, 'h': 450, 'resize': 'fit'}, 'thumb': {'w': 150, 'h': 150, 'resize': 'crop'}, 'medium': {'w': 1200, 'h': 793, 'resize': 'fit'}, 'large': {'w': 1325, 'h': 876, 'resize': 'fit'}}}]};{'iso_language_code': 'en', 'result_type': 'recent'};"<a href=""https://mobile.twitter.com"" rel=""nofollow"">Twitter Web App</a>";;;;;;"{'id': 848907740, 'id_str': '848907740', 'name': 'IOM Iraq', 'screen_name': 'IOMIraq', 'location': 'Iraq', 'description': ""IOM Iraq has been providing assistance to Iraq's most vulnerable populations since 2003. \nhttps://t.co/dcuTn3I2Mn"", 'url': 'https://t.co/Ge9uoC3i5f', 'entities': {'url': {'urls': [{'url': 'https://t.co/Ge9uoC3i5f', 'expanded_url': 'http://www.iom.int/', 'display_url': 'iom.int', 'indices': [0, 23]}]}, 'description': {'urls': [{'url': 'https://t.co/dcuTn3I2Mn', 'expanded_url': 'http://iraq.iom.int', 'display_url': 'iraq.iom.int', 'indices': [90, 113]}]}}, 'protected': False, 'followers_count': 27064, 'friends_count': 915, 'listed_count': 204, 'created_at': 'Thu Sep 27 08:43:26 +0000 2012', 'favourites_count': 1529, 'utc_offset': None, 'time_zone': None, 'geo_enabled': False, 'verified': True, 'statuses_count': 4254, 'lang': None, 'contributors_enabled': False, 'is_translator': False, 'is_translation_enabled': False, 'profile_background_color': 'C0DEED', 'profile_background_image_url': 'http://abs.twimg.com/images/themes/theme1/bg.png', 'profile_background_image_url_https': 'https://abs.twimg.com/images/themes/theme1/bg.png', 'profile_background_tile': True, 'profile_image_url': 'http://pbs.twimg.com/profile_images/1011890475018534912/1_lKi15n_normal.jpg', 'profile_image_url_https': 'https://pbs.twimg.com/profile_images/1011890475018534912/1_lKi15n_normal.jpg', 'profile_banner_url': 'https://pbs.twimg.com/profile_banners/848907740/1587743253', 'profile_link_color': '1B95E0', 'profile_sidebar_border_color': 'FFFFFF', 'profile_sidebar_fill_color': 'DDEEF6', 'profile_text_color': '333333', 'profile_use_background_image': True, 'has_extended_profile': False, 'default_profile': False, 'default_profile_image': False, 'following': False, 'follow_request_sent': False, 'notifications': False, 'translator_type': 'none'}";;;;;;False;10;25;False;False;en;False;;{'media': [{'id': 1297981252633612294, 'id_str': '1297981252633612294', 'indices': [276, 299], 'media_url': 'http://pbs.twimg.com/media/EgNbEoBX0AYqo4V.jpg', 'media_url_https': 'https://pbs.twimg.com/media/EgNbEoBX0AYqo4V.jpg', 'url': 'https://t.co/eZf1e1E4Jl', 'display_url': 'pic.twitter.com/eZf1e1E4Jl', 'expanded_url': 'https://twitter.com/IOMIraq/status/1297981797700173825/photo/1', 'type': 'photo', 'sizes': {'small': {'w': 680, 'h': 450, 'resize': 'fit'}, 'thumb': {'w': 150, 'h': 150, 'resize': 'crop'}, 'medium': {'w': 1200, 'h': 793, 'resize': 'fit'}, 'large': {'w': 1325, 'h': 876, 'resize': 'fit'}}}, {'id': 1297981347529658368, 'id_str': '1297981347529658368', 'indices': [276, 299], 'media_url': 'http://pbs.twimg.com/media/EgNbKJiWkAAr5Nr.jpg', 'media_url_https': 'https://pbs.twimg.com/media/EgNbKJiWkAAr5Nr.jpg', 'url': 'https://t.co/eZf1e1E4Jl', 'display_url': 'pic.twitter.com/eZf1e1E4Jl', 'expanded_url': 'https://twitter.com/IOMIraq/status/1297981797700173825/photo/1', 'type': 'photo', 'sizes': {'large': {'w': 1320, 'h': 893, 'resize': 'fit'}, 'thumb': {'w': 150, 'h': 150, 'resize': 'crop'}, 'medium': {'w': 1200, 'h': 812, 'resize': 'fit'}, 'small': {'w': 680, 'h': 460, 'resize': 'fit'}}}]};;;;;;1
23;Sat Aug 29 15:46:55 +0000 2020;1.29973528943962E+018;1.29973528943962E+018;@_emilync @EMBARCiowa is currently taking donations to help with derecho relief in Cedar Rapids!! Several refugee housing complexes were destroyed so there’s a large number of refugees displaced rn!!;False;[10, 199];{'hashtags': [], 'symbols': [], 'user_mentions': [{'screen_name': '_emilync', 'name': 'emilyn✨😷/BLM/67 days', 'id': 749612041, 'id_str': '749612041', 'indices': [0, 9]}, {'screen_name': 'EMBARCiowa', 'name': 'EMBARC', 'id': 4428043767, 'id_str': '4428043767', 'indices': [10, 21]}], 'urls': []};{'iso_language_code': 'en', 'result_type': 'recent'};"<a href=""http://twitter.com/download/iphone"" rel=""nofollow"">Twitter for iPhone</a>";1.29972335071824E+018;1.29972335071824E+018;749612041;749612041;_emilync;{'id': 2785996110, 'id_str': '2785996110', 'name': 'Taylor Fisher', 'screen_name': 'tay_a_fisher', 'location': '', 'description': 'a fragile, yet passionate egg', 'url': None, 'entities': {'description': {'urls': []}}, 'protected': False, 'followers_count': 198, 'friends_count': 250, 'listed_count': 0, 'created_at': 'Tue Sep 02 13:53:45 +0000 2014', 'favourites_count': 8538, 'utc_offset': None, 'time_zone': None, 'geo_enabled': False, 'verified': False, 'statuses_count': 1732, 'lang': None, 'contributors_enabled': False, 'is_translator': False, 'is_translation_enabled': False, 'profile_background_color': '642D8B', 'profile_background_image_url': 'http://abs.twimg.com/images/themes/theme10/bg.gif', 'profile_background_image_url_https': 'https://abs.twimg.com/images/themes/theme10/bg.gif', 'profile_background_tile': True, 'profile_image_url': 'http://pbs.twimg.com/profile_images/1297330884165742597/mr6vtGW5_normal.jpg', 'profile_image_url_https': 'https://pbs.twimg.com/profile_images/1297330884165742597/mr6vtGW5_normal.jpg', 'profile_banner_url': 'https://pbs.twimg.com/profile_banners/2785996110/1501695696', 'profile_link_color': '56F345', 'profile_sidebar_border_color': '000000', 'profile_sidebar_fill_color': '000000', 'profile_text_color': '000000', 'profile_use_background_image': True, 'has_extended_profile': True, 'default_profile': False, 'default_profile_image': False, 'following': False, 'follow_request_sent': False, 'notifications': False, 'translator_type': 'none'};;;;;;False;0;1;False;False;en;;;;;;;;;1
15;Sun Aug 09 23:51:01 +0000 2020;1.2926093613287E+018;1.2926093613287E+018;"@Shout4Change @KimWebb44671708 @formallyhuman @ShaunBaileyUK @juneh49 @SadiqKhan @Channel4News As a Socialist, I'm disgusted at the way @UKLabour has destroyed council housing in London and displaced working class communities via its rampant social-cleansing policies.
#SocialCleansing 
#ForTheFew https://t.co/lm0tB6kyHk";False;[95, 297];{'hashtags': [{'text': 'SocialCleansing', 'indices': [269, 285]}, {'text': 'ForTheFew', 'indices': [287, 297]}], 'symbols': [], 'user_mentions': [{'screen_name': 'Shout4Change', 'name': 'Shout4Change', 'id': 1020783828808470528, 'id_str': '1020783828808470528', 'indices': [0, 13]}, {'screen_name': 'KimWebb44671708', 'name': 'Harriet Palmer', 'id': 1250158141997752332, 'id_str': '1250158141997752332', 'indices': [14, 30]}, {'screen_name': 'formallyhuman', 'name': 'マクギネス デビッド', 'id': 1062844718097272832, 'id_str': '1062844718097272832', 'indices': [31, 45]}, {'screen_name': 'ShaunBaileyUK', 'name': 'Shaun Bailey', 'id': 40451753, 'id_str': '40451753', 'indices': [46, 60]}, {'screen_name': 'juneh49', 'name': 'June Hurst 🐈🦊🌷🌻🌾', 'id': 298063367, 'id_str': '298063367', 'indices': [61, 69]}, {'screen_name': 'SadiqKhan', 'name': 'Sadiq Khan', 'id': 19397942, 'id_str': '19397942', 'indices': [70, 80]}, {'screen_name': 'Channel4News', 'name': 'Channel 4 News', 'id': 14569869, 'id_str': '14569869', 'indices': [81, 94]}, {'screen_name': 'UKLabour', 'name': 'The Labour Party', 'id': 14291684, 'id_str': '14291684', 'indices': [136, 145]}], 'urls': [], 'media': [{'id': 1292608832846299137, 'id_str': '1292608832846299137', 'indices': [298, 321], 'media_url': 'http://pbs.twimg.com/media/EfBE4otWAAEJCW4.jpg', 'media_url_https': 'https://pbs.twimg.com/media/EfBE4otWAAEJCW4.jpg', 'url': 'https://t.co/lm0tB6kyHk', 'display_url': 'pic.twitter.com/lm0tB6kyHk', 'expanded_url': 'https://twitter.com/TrevorWAllman/status/1292609361328701442/photo/1', 'type': 'photo', 'sizes': {'medium': {'w': 613, 'h': 960, 'resize': 'fit'}, 'thumb': {'w': 150, 'h': 150, 'resize': 'crop'}, 'large': {'w': 613, 'h': 960, 'resize': 'fit'}, 'small': {'w': 434, 'h': 680, 'resize': 'fit'}}}]};{'iso_language_code': 'en', 'result_type': 'recent'};"<a href=""https://mobile.twitter.com"" rel=""nofollow"">Twitter Web App</a>";1.2925944384857E+018;1.2925944384857E+018;1.02078382880847E+018;1.02078382880847E+018;Shout4Change;{'id': 526020270, 'id_str': '526020270', 'name': 'TREVOR ALLMAN', 'screen_name': 'TrevorWAllman', 'location': 'Blackheath', 'description': 'AKA - Lord Halfperson. Actor. Cray Valley (PM) FC fan. Greenwich Borough Councillor (1986-90). Equity London Ctte (2003-07). @Official_MRLP Candidate (2018).', 'url': None, 'entities': {'description': {'urls': []}}, 'protected': False, 'followers_count': 1243, 'friends_count': 132, 'listed_count': 64, 'created_at': 'Fri Mar 16 04:12:34 +0000 2012', 'favourites_count': 70579, 'utc_offset': None, 'time_zone': None, 'geo_enabled': False, 'verified': False, 'statuses_count': 113090, 'lang': None, 'contributors_enabled': False, 'is_translator': False, 'is_translation_enabled': False, 'profile_background_color': 'FFF04D', 'profile_background_image_url': 'http://abs.twimg.com/images/themes/theme19/bg.gif', 'profile_background_image_url_https': 'https://abs.twimg.com/images/themes/theme19/bg.gif', 'profile_background_tile': True, 'profile_image_url': 'http://pbs.twimg.com/profile_images/920688412381908994/Vcd90s_e_normal.jpg', 'profile_image_url_https': 'https://pbs.twimg.com/profile_images/920688412381908994/Vcd90s_e_normal.jpg', 'profile_banner_url': 'https://pbs.twimg.com/profile_banners/526020270/1564417496', 'profile_link_color': 'DD2E44', 'profile_sidebar_border_color': '000000', 'profile_sidebar_fill_color': '000000', 'profile_text_color': '000000', 'profile_use_background_image': True, 'has_extended_profile': False, 'default_profile': False, 'default_profile_image': False, 'following': False, 'follow_request_sent': False, 'notifications': False, 'translator_type': 'none'};;;;;;False;1;0;False;False;en;False;;{'media': [{'id': 1292608832846299137, 'id_str': '1292608832846299137', 'indices': [298, 321], 'media_url': 'http://pbs.twimg.com/media/EfBE4otWAAEJCW4.jpg', 'media_url_https': 'https://pbs.twimg.com/media/EfBE4otWAAEJCW4.jpg', 'url': 'https://t.co/lm0tB6kyHk', 'display_url': 'pic.twitter.com/lm0tB6kyHk', 'expanded_url': 'https://twitter.com/TrevorWAllman/status/1292609361328701442/photo/1', 'type': 'photo', 'sizes': {'medium': {'w': 613, 'h': 960, 'resize': 'fit'}, 'thumb': {'w': 150, 'h': 150, 'resize': 'crop'}, 'large': {'w': 613, 'h': 960, 'resize': 'fit'}, 'small': {'w': 434, 'h': 680, 'resize': 'fit'}}}]};;;;;;1
14;Sun Aug 09 23:55:16 +0000 2020;1.29261042868254E+018;1.29261042868254E+018;"@Thurston62 @AlistairGordon1 @IronbridgeAAC @ShaunBaileyUK @ShropshireMan @SadiqKhan @Channel4News Indeed, @UKLabour have changed things in London.
They have destroyed council housing and displaced working class communities via their social-cleansing policies.
#SocialCleansing 
#ForTheFew https://t.co/iYPnKGyZjv";False;[99, 289];{'hashtags': [{'text': 'SocialCleansing', 'indices': [261, 277]}, {'text': 'ForTheFew', 'indices': [279, 289]}], 'symbols': [], 'user_mentions': [{'screen_name': 'Thurston62', 'name': 'David Thurston', 'id': 282631658, 'id_str': '282631658', 'indices': [0, 11]}, {'screen_name': 'AlistairGordon1', 'name': 'Alistair Gordon', 'id': 346174564, 'id_str': '346174564', 'indices': [12, 28]}, {'screen_name': 'IronbridgeAAC', 'name': 'Ironbridge_AAC Nige', 'id': 454851026, 'id_str': '454851026', 'indices': [29, 43]}, {'screen_name': 'ShaunBaileyUK', 'name': 'Shaun Bailey', 'id': 40451753, 'id_str': '40451753', 'indices': [44, 58]}, {'screen_name': 'ShropshireMan', 'name': 'Andrew Finch', 'id': 36510981, 'id_str': '36510981', 'indices': [59, 73]}, {'screen_name': 'SadiqKhan', 'name': 'Sadiq Khan', 'id': 19397942, 'id_str': '19397942', 'indices': [74, 84]}, {'screen_name': 'Channel4News', 'name': 'Channel 4 News', 'id': 14569869, 'id_str': '14569869', 'indices': [85, 98]}, {'screen_name': 'UKLabour', 'name': 'The Labour Party', 'id': 14291684, 'id_str': '14291684', 'indices': [107, 116]}], 'urls': [], 'media': [{'id': 1292610039031779328, 'id_str': '1292610039031779328', 'indices': [290, 313], 'media_url': 'http://pbs.twimg.com/media/EfBF-2GX0AAOfl5.jpg', 'media_url_https': 'https://pbs.twimg.com/media/EfBF-2GX0AAOfl5.jpg', 'url': 'https://t.co/iYPnKGyZjv', 'display_url': 'pic.twitter.com/iYPnKGyZjv', 'expanded_url': 'https://twitter.com/TrevorWAllman/status/1292610428682539008/photo/1', 'type': 'photo', 'sizes': {'medium': {'w': 613, 'h': 960, 'resize': 'fit'}, 'thumb': {'w': 150, 'h': 150, 'resize': 'crop'}, 'large': {'w': 613, 'h': 960, 'resize': 'fit'}, 'small': {'w': 434, 'h': 680, 'resize': 'fit'}}}]};{'iso_language_code': 'en', 'result_type': 'recent'};"<a href=""https://mobile.twitter.com"" rel=""nofollow"">Twitter Web App</a>";1.29254274876412E+018;1.29254274876412E+018;282631658;282631658;Thurston62;{'id': 526020270, 'id_str': '526020270', 'name': 'TREVOR ALLMAN', 'screen_name': 'TrevorWAllman', 'location': 'Blackheath', 'description': 'AKA - Lord Halfperson. Actor. Cray Valley (PM) FC fan. Greenwich Borough Councillor (1986-90). Equity London Ctte (2003-07). @Official_MRLP Candidate (2018).', 'url': None, 'entities': {'description': {'urls': []}}, 'protected': False, 'followers_count': 1243, 'friends_count': 132, 'listed_count': 64, 'created_at': 'Fri Mar 16 04:12:34 +0000 2012', 'favourites_count': 70579, 'utc_offset': None, 'time_zone': None, 'geo_enabled': False, 'verified': False, 'statuses_count': 113090, 'lang': None, 'contributors_enabled': False, 'is_translator': False, 'is_translation_enabled': False, 'profile_background_color': 'FFF04D', 'profile_background_image_url': 'http://abs.twimg.com/images/themes/theme19/bg.gif', 'profile_background_image_url_https': 'https://abs.twimg.com/images/themes/theme19/bg.gif', 'profile_background_tile': True, 'profile_image_url': 'http://pbs.twimg.com/profile_images/920688412381908994/Vcd90s_e_normal.jpg', 'profile_image_url_https': 'https://pbs.twimg.com/profile_images/920688412381908994/Vcd90s_e_normal.jpg', 'profile_banner_url': 'https://pbs.twimg.com/profile_banners/526020270/1564417496', 'profile_link_color': 'DD2E44', 'profile_sidebar_border_color': '000000', 'profile_sidebar_fill_color': '000000', 'profile_text_color': '000000', 'profile_use_background_image': True, 'has_extended_profile': False, 'default_profile': False, 'default_profile_image': False, 'following': False, 'follow_request_sent': False, 'notifications': False, 'translator_type': 'none'};;;;;;False;0;0;False;False;en;False;;{'media': [{'id': 1292610039031779328, 'id_str': '1292610039031779328', 'indices': [290, 313], 'media_url': 'http://pbs.twimg.com/media/EfBF-2GX0AAOfl5.jpg', 'media_url_https': 'https://pbs.twimg.com/media/EfBF-2GX0AAOfl5.jpg', 'url': 'https://t.co/iYPnKGyZjv', 'display_url': 'pic.twitter.com/iYPnKGyZjv', 'expanded_url': 'https://twitter.com/TrevorWAllman/status/1292610428682539008/photo/1', 'type': 'photo', 'sizes': {'medium': {'w': 613, 'h': 960, 'resize': 'fit'}, 'thumb': {'w': 150, 'h': 150, 'resize': 'crop'}, 'large': {'w': 613, 'h': 960, 'resize': 'fit'}, 'small': {'w': 434, 'h': 680, 'resize': 'fit'}}}]};;;;;;1
21;Sun Sep 06 16:00:34 +0000 2020;1.30263782624538E+018;1.30263782624538E+018;Last night a fire destroyed several rooms at the Village Green Motel in Brewer. Several people lived at the motel and are now working with the Red Cross to find temporary housing. One owner tells me she is heartbroken for those displaced by the fire. @newscentermaine https://t.co/9Vfg3FP9Oi;False;[0, 267];{'hashtags': [], 'symbols': [], 'user_mentions': [{'screen_name': 'newscentermaine', 'name': 'NEWS CENTER Maine', 'id': 16538186, 'id_str': '16538186', 'indices': [251, 267]}], 'urls': [], 'media': [{'id': 1302637809371676672, 'id_str': '1302637809371676672', 'indices': [268, 291], 'media_url': 'http://pbs.twimg.com/media/EhPmL5qXgAANcCu.jpg', 'media_url_https': 'https://pbs.twimg.com/media/EhPmL5qXgAANcCu.jpg', 'url': 'https://t.co/9Vfg3FP9Oi', 'display_url': 'pic.twitter.com/9Vfg3FP9Oi', 'expanded_url': 'https://twitter.com/slaminsamNCM/status/1302637826245382145/photo/1', 'type': 'photo', 'sizes': {'thumb': {'w': 150, 'h': 150, 'resize': 'crop'}, 'large': {'w': 2048, 'h': 1536, 'resize': 'fit'}, 'medium': {'w': 1200, 'h': 900, 'resize': 'fit'}, 'small': {'w': 680, 'h': 510, 'resize': 'fit'}}}]};{'iso_language_code': 'en', 'result_type': 'recent'};"<a href=""http://twitter.com/download/iphone"" rel=""nofollow"">Twitter for iPhone</a>";;;;;;{'id': 258148122, 'id_str': '258148122', 'name': 'Sam Rogers', 'screen_name': 'slaminsamNCM', 'location': 'North of the Wall', 'description': 'Reporter / MSJ - @NEWSCENTERMaine - It’s not gambling if you know you’re going to win - #508 @UofNH', 'url': 'https://t.co/4QmB2FbWIq', 'entities': {'url': {'urls': [{'url': 'https://t.co/4QmB2FbWIq', 'expanded_url': 'http://www.newscentermaine.com', 'display_url': 'newscentermaine.com', 'indices': [0, 23]}]}, 'description': {'urls': []}}, 'protected': False, 'followers_count': 1043, 'friends_count': 626, 'listed_count': 10, 'created_at': 'Sun Feb 27 02:21:58 +0000 2011', 'favourites_count': 9895, 'utc_offset': None, 'time_zone': None, 'geo_enabled': True, 'verified': True, 'statuses_count': 11582, 'lang': None, 'contributors_enabled': False, 'is_translator': False, 'is_translation_enabled': False, 'profile_background_color': 'C0DEED', 'profile_background_image_url': 'http://abs.twimg.com/images/themes/theme1/bg.png', 'profile_background_image_url_https': 'https://abs.twimg.com/images/themes/theme1/bg.png', 'profile_background_tile': False, 'profile_image_url': 'http://pbs.twimg.com/profile_images/1293328912500568066/47x5nuW-_normal.jpg', 'profile_image_url_https': 'https://pbs.twimg.com/profile_images/1293328912500568066/47x5nuW-_normal.jpg', 'profile_banner_url': 'https://pbs.twimg.com/profile_banners/258148122/1574726749', 'profile_link_color': '1DA1F2', 'profile_sidebar_border_color': 'C0DEED', 'profile_sidebar_fill_color': 'DDEEF6', 'profile_text_color': '333333', 'profile_use_background_image': True, 'has_extended_profile': False, 'default_profile': True, 'default_profile_image': False, 'following': False, 'follow_request_sent': False, 'notifications': False, 'translator_type': 'none'};;;;;;False;3;4;False;False;en;False;;{'media': [{'id': 1302637809371676672, 'id_str': '1302637809371676672', 'indices': [268, 291], 'media_url': 'http://pbs.twimg.com/media/EhPmL5qXgAANcCu.jpg', 'media_url_https': 'https://pbs.twimg.com/media/EhPmL5qXgAANcCu.jpg', 'url': 'https://t.co/9Vfg3FP9Oi', 'display_url': 'pic.twitter.com/9Vfg3FP9Oi', 'expanded_url': 'https://twitter.com/slaminsamNCM/status/1302637826245382145/photo/1', 'type': 'photo', 'sizes': {'thumb': {'w': 150, 'h': 150, 'resize': 'crop'}, 'large': {'w': 2048, 'h': 1536, 'resize': 'fit'}, 'medium': {'w': 1200, 'h': 900, 'resize': 'fit'}, 'small': {'w': 680, 'h': 510, 'resize': 'fit'}}}, {'id': 1302637809350606849, 'id_str': '1302637809350606849', 'indices': [268, 291], 'media_url': 'http://pbs.twimg.com/media/EhPmL5lWAAEYj2T.jpg', 'media_url_https': 'https://pbs.twimg.com/media/EhPmL5lWAAEYj2T.jpg', 'url': 'https://t.co/9Vfg3FP9Oi', 'display_url': 'pic.twitter.com/9Vfg3FP9Oi', 'expanded_url': 'https://twitter.com/slaminsamNCM/status/1302637826245382145/photo/1', 'type': 'photo', 'sizes': {'thumb': {'w': 150, 'h': 150, 'resize': 'crop'}, 'medium': {'w': 1200, 'h': 900, 'resize': 'fit'}, 'large': {'w': 2048, 'h': 1536, 'resize': 'fit'}, 'small': {'w': 680, 'h': 510, 'resize': 'fit'}}}, {'id': 1302637809350701058, 'id_str': '1302637809350701058', 'indices': [268, 291], 'media_url': 'http://pbs.twimg.com/media/EhPmL5lXcAI2uM5.jpg', 'media_url_https': 'https://pbs.twimg.com/media/EhPmL5lXcAI2uM5.jpg', 'url': 'https://t.co/9Vfg3FP9Oi', 'display_url': 'pic.twitter.com/9Vfg3FP9Oi', 'expanded_url': 'https://twitter.com/slaminsamNCM/status/1302637826245382145/photo/1', 'type': 'photo', 'sizes': {'large': {'w': 2048, 'h': 1536, 'resize': 'fit'}, 'thumb': {'w': 150, 'h': 150, 'resize': 'crop'}, 'small': {'w': 680, 'h': 510, 'resize': 'fit'}, 'medium': {'w': 1200, 'h': 900, 'resize': 'fit'}}}, {'id': 1302637809346531329, 'id_str': '1302637809346531329', 'indices': [268, 291], 'media_url': 'http://pbs.twimg.com/media/EhPmL5kX0AE0D2u.jpg', 'media_url_https': 'https://pbs.twimg.com/media/EhPmL5kX0AE0D2u.jpg', 'url': 'https://t.co/9Vfg3FP9Oi', 'display_url': 'pic.twitter.com/9Vfg3FP9Oi', 'expanded_url': 'https://twitter.com/slaminsamNCM/status/1302637826245382145/photo/1', 'type': 'photo', 'sizes': {'large': {'w': 2048, 'h': 1536, 'resize': 'fit'}, 'thumb': {'w': 150, 'h': 150, 'resize': 'crop'}, 'small': {'w': 680, 'h': 510, 'resize': 'fit'}, 'medium': {'w': 1200, 'h': 900, 'resize': 'fit'}}}]};;;;;;1
9;Thu Aug 06 15:36:00 +0000 2020;1.29139762281365E+018;1.29139762281365E+018;Lives are destroyed on the regular here. People are displaced and traumatized. Communities are fractured and disempowered. Housing justice HAS to be a part of our conversation in Philly. /19;False;[0, 190];{'hashtags': [], 'symbols': [], 'user_mentions': [], 'urls': []};{'iso_language_code': 'en', 'result_type': 'recent'};"<a href=""http://twitter.com/download/iphone"" rel=""nofollow"">Twitter for iPhone</a>";1.29139762142534E+018;1.29139762142534E+018;549312179;549312179;wherehousemimi;{'id': 549312179, 'id_str': '549312179', 'name': 'Call me Cassandra', 'screen_name': 'wherehousemimi', 'location': 'West Philly', 'description': 'Can we agree that basic safety from assault is a fundamental human right?', 'url': None, 'entities': {'description': {'urls': []}}, 'protected': False, 'followers_count': 95, 'friends_count': 591, 'listed_count': 0, 'created_at': 'Mon Apr 09 15:28:02 +0000 2012', 'favourites_count': 4352, 'utc_offset': None, 'time_zone': None, 'geo_enabled': False, 'verified': False, 'statuses_count': 1785, 'lang': None, 'contributors_enabled': False, 'is_translator': False, 'is_translation_enabled': False, 'profile_background_color': 'C0DEED', 'profile_background_image_url': 'http://abs.twimg.com/images/themes/theme1/bg.png', 'profile_background_image_url_https': 'https://abs.twimg.com/images/themes/theme1/bg.png', 'profile_background_tile': False, 'profile_image_url': 'http://pbs.twimg.com/profile_images/796383604968452096/Vwju2mXC_normal.jpg', 'profile_image_url_https': 'https://pbs.twimg.com/profile_images/796383604968452096/Vwju2mXC_normal.jpg', 'profile_banner_url': 'https://pbs.twimg.com/profile_banners/549312179/1478707621', 'profile_link_color': '1DA1F2', 'profile_sidebar_border_color': 'C0DEED', 'profile_sidebar_fill_color': 'DDEEF6', 'profile_text_color': '333333', 'profile_use_background_image': True, 'has_extended_profile': True, 'default_profile': True, 'default_profile_image': False, 'following': False, 'follow_request_sent': False, 'notifications': False, 'translator_type': 'none'};;;;;;False;0;0;False;False;en;;;;;;;;;1
3;Tue Aug 18 22:31:30 +0000 2020;1.29585084086802E+018;1.29585084086802E+018;"One of their goals is to ensure that those displaced from the units destroyed or significantly damaged by the fire can secure housing in local hotels while longer-term logistics of housing can be managed.
 https://t.co/fMNbIk8AQ1";False;[0, 229];{'hashtags': [], 'symbols': [], 'user_mentions': [], 'urls': [{'url': 'https://t.co/fMNbIk8AQ1', 'expanded_url': 'http://chieftain.com/news/20200818/pueblo-united-way-leads-effort-to-help-displaced-fire-victims', 'display_url': 'chieftain.com/news/20200818/…', 'indices': [206, 229]}]};{'iso_language_code': 'en', 'result_type': 'recent'};"<a href=""http://twitter.com/download/iphone"" rel=""nofollow"">Twitter for iPhone</a>";;;;;;{'id': 280850308, 'id_str': '280850308', 'name': 'Anthony A. Mestas', 'screen_name': 'mestas3517', 'location': 'Pueblo Colorado', 'description': 'Crime Reporter with The Pueblo Chieftain also covering Pueblo County Gov., CSU-Pueblo, PCC, Steel City. Star Wars, Denver Broncos Maniac and CSU-Pueblo alumnus.', 'url': 'https://t.co/Oc7rFJnRVA', 'entities': {'url': {'urls': [{'url': 'https://t.co/Oc7rFJnRVA', 'expanded_url': 'http://www.chieftain.com', 'display_url': 'chieftain.com', 'indices': [0, 23]}]}, 'description': {'urls': []}}, 'protected': False, 'followers_count': 1815, 'friends_count': 588, 'listed_count': 50, 'created_at': 'Tue Apr 12 04:21:16 +0000 2011', 'favourites_count': 1457, 'utc_offset': None, 'time_zone': None, 'geo_enabled': False, 'verified': False, 'statuses_count': 15396, 'lang': None, 'contributors_enabled': False, 'is_translator': False, 'is_translation_enabled': False, 'profile_background_color': '060F12', 'profile_background_image_url': 'http://abs.twimg.com/images/themes/theme15/bg.png', 'profile_background_image_url_https': 'https://abs.twimg.com/images/themes/theme15/bg.png', 'profile_background_tile': True, 'profile_image_url': 'http://pbs.twimg.com/profile_images/1228819673304559616/iAj1Z_SY_normal.jpg', 'profile_image_url_https': 'https://pbs.twimg.com/profile_images/1228819673304559616/iAj1Z_SY_normal.jpg', 'profile_banner_url': 'https://pbs.twimg.com/profile_banners/280850308/1354144217', 'profile_link_color': '0084B4', 'profile_sidebar_border_color': 'A8C7F7', 'profile_sidebar_fill_color': 'C0DFEC', 'profile_text_color': '333333', 'profile_use_background_image': True, 'has_extended_profile': True, 'default_profile': False, 'default_profile_image': False, 'following': False, 'follow_request_sent': False, 'notifications': False, 'translator_type': 'none'};;;;;;False;0;3;False;False;en;False;;;;;;;;1
25;Tue Aug 25 17:36:13 +0000 2020;1.29831324387892E+018;1.29831324387892E+018;@bluetroll21 @dcexaminer In this era of one extreme or the other, no , it is not allowed. Either you applaud everything destroyed in protests (including a low income housing building in kenosha, where families will be displaced until alternative housing is found-on their own until then) or you are maga;False;[25, 303];{'hashtags': [], 'symbols': [], 'user_mentions': [{'screen_name': 'bluetroll21', 'name': 'Milton Keynes', 'id': 2607995856, 'id_str': '2607995856', 'indices': [0, 12]}, {'screen_name': 'dcexaminer', 'name': 'Washington Examiner', 'id': 18956073, 'id_str': '18956073', 'indices': [13, 24]}], 'urls': []};{'iso_language_code': 'en', 'result_type': 'recent'};"<a href=""http://twitter.com/download/android"" rel=""nofollow"">Twitter for Android</a>";1.29830884775348E+018;1.29830884775348E+018;2607995856;2607995856;bluetroll21;{'id': 975638790176784384, 'id_str': '975638790176784384', 'name': '🌹AshumsFromTheChi🌹🦺', 'screen_name': 'Ortizjorlando90', 'location': 'Chicago, IL', 'description': '❤Mommy of 3❤ ⚾ChiCubs🏈DaBears🌹🌹🌹 🙏 CASHAPP $mommyshums3 VENMO MommyShums333', 'url': None, 'entities': {'description': {'urls': []}}, 'protected': False, 'followers_count': 2862, 'friends_count': 4990, 'listed_count': 9, 'created_at': 'Mon Mar 19 07:43:08 +0000 2018', 'favourites_count': 5270, 'utc_offset': None, 'time_zone': None, 'geo_enabled': True, 'verified': False, 'statuses_count': 6002, 'lang': None, 'contributors_enabled': False, 'is_translator': False, 'is_translation_enabled': False, 'profile_background_color': 'F5F8FA', 'profile_background_image_url': None, 'profile_background_image_url_https': None, 'profile_background_tile': False, 'profile_image_url': 'http://pbs.twimg.com/profile_images/1295960728176910336/967o89n2_normal.jpg', 'profile_image_url_https': 'https://pbs.twimg.com/profile_images/1295960728176910336/967o89n2_normal.jpg', 'profile_banner_url': 'https://pbs.twimg.com/profile_banners/975638790176784384/1583991062', 'profile_link_color': '1DA1F2', 'profile_sidebar_border_color': 'C0DEED', 'profile_sidebar_fill_color': 'DDEEF6', 'profile_text_color': '333333', 'profile_use_background_image': True, 'has_extended_profile': False, 'default_profile': True, 'default_profile_image': False, 'following': False, 'follow_request_sent': False, 'notifications': False, 'translator_type': 'none'};;;;;;False;0;1;False;False;en;;;;;;;;;1
22;Tue Sep 01 23:13:33 +0000 2020;1.30093485339598E+018;1.30093485339598E+018;"@DanR_Breen @DavidAllyn68 @DanPriceSeattle Recall that Amazon benefited (&amp; destroyed many Local businesses) by being exempt from sales tax for many years. Those fire hone taxes could have paid for training of displaced workers, health care, housing, etc. Instead, Bezos was the main beneficiary of that indirect subsidy.";False;[43, 324];{'hashtags': [], 'symbols': [], 'user_mentions': [{'screen_name': 'DanR_Breen', 'name': 'Dan Breen', 'id': 300045588, 'id_str': '300045588', 'indices': [0, 11]}, {'screen_name': 'DavidAllyn68', 'name': 'David Allyn', 'id': 88433907, 'id_str': '88433907', 'indices': [12, 25]}, {'screen_name': 'DanPriceSeattle', 'name': 'Dan Price', 'id': 2172596028, 'id_str': '2172596028', 'indices': [26, 42]}], 'urls': []};{'iso_language_code': 'en', 'result_type': 'recent'};"<a href=""http://twitter.com/download/iphone"" rel=""nofollow"">Twitter for iPhone</a>";1.30087518156139E+018;1.30087518156139E+018;300045588;300045588;DanR_Breen;{'id': 240459803, 'id_str': '240459803', 'name': 'CaptainLiz', 'screen_name': 'lizziemaef', 'location': '', 'description': 'Just trying to vent in a semi-productive manner while keeping tabs on disinformation & conspiracy theories that are destroying our democracy.', 'url': None, 'entities': {'description': {'urls': []}}, 'protected': False, 'followers_count': 204, 'friends_count': 472, 'listed_count': 1, 'created_at': 'Thu Jan 20 00:08:31 +0000 2011', 'favourites_count': 24056, 'utc_offset': None, 'time_zone': None, 'geo_enabled': False, 'verified': False, 'statuses_count': 10790, 'lang': None, 'contributors_enabled': False, 'is_translator': False, 'is_translation_enabled': False, 'profile_background_color': 'C0DEED', 'profile_background_image_url': 'http://abs.twimg.com/images/themes/theme1/bg.png', 'profile_background_image_url_https': 'https://abs.twimg.com/images/themes/theme1/bg.png', 'profile_background_tile': False, 'profile_image_url': 'http://pbs.twimg.com/profile_images/1284984838219423746/X7j5HdKM_normal.jpg', 'profile_image_url_https': 'https://pbs.twimg.com/profile_images/1284984838219423746/X7j5HdKM_normal.jpg', 'profile_banner_url': 'https://pbs.twimg.com/profile_banners/240459803/1591378999', 'profile_link_color': '1DA1F2', 'profile_sidebar_border_color': 'C0DEED', 'profile_sidebar_fill_color': 'DDEEF6', 'profile_text_color': '333333', 'profile_use_background_image': True, 'has_extended_profile': False, 'default_profile': True, 'default_profile_image': False, 'following': False, 'follow_request_sent': False, 'notifications': False, 'translator_type': 'none'};;;;;;False;0;0;False;False;en;;;;;;;;;1
11;Wed Jul 15 01:13:37 +0000 2020;1.283208060304E+018;1.283208060304E+018;"@Noahpinion Thanks, I’ll check that out. So that’s where the people who got displaced when public housing stock was destroyed went(?).
I’m curious if that made the country somewhat less segregated and whether that was unintentional on the part of politicians who pushed to end public housing";False;[12, 291];{'hashtags': [], 'symbols': [], 'user_mentions': [{'screen_name': 'Noahpinion', 'name': 'Noah Smith 🐇', 'id': 281877818, 'id_str': '281877818', 'indices': [0, 11]}], 'urls': []};{'iso_language_code': 'en', 'result_type': 'recent'};"<a href=""https://mobile.twitter.com"" rel=""nofollow"">Twitter Web App</a>";1.28320530699498E+018;1.28320530699498E+018;281877818;281877818;Noahpinion;{'id': 4862121, 'id_str': '4862121', 'name': 'End police violence', 'screen_name': 'JakePoysti', 'location': 'Raleigh, NC', 'description': 'progressive • immigrant • Advocating for systemic change nationally & locally Topics: politics, #ralpol, transportation, travel + personal finance #EndRacismNow', 'url': None, 'entities': {'description': {'urls': []}}, 'protected': False, 'followers_count': 470, 'friends_count': 415, 'listed_count': 3, 'created_at': 'Mon Apr 16 10:56:33 +0000 2007', 'favourites_count': 154160, 'utc_offset': None, 'time_zone': None, 'geo_enabled': False, 'verified': False, 'statuses_count': 20312, 'lang': None, 'contributors_enabled': False, 'is_translator': False, 'is_translation_enabled': False, 'profile_background_color': '0099B9', 'profile_background_image_url': 'http://abs.twimg.com/images/themes/theme4/bg.gif', 'profile_background_image_url_https': 'https://abs.twimg.com/images/themes/theme4/bg.gif', 'profile_background_tile': False, 'profile_image_url': 'http://pbs.twimg.com/profile_images/550828346330722304/mHERUNZW_normal.jpeg', 'profile_image_url_https': 'https://pbs.twimg.com/profile_images/550828346330722304/mHERUNZW_normal.jpeg', 'profile_banner_url': 'https://pbs.twimg.com/profile_banners/4862121/1574313227', 'profile_link_color': '0099B9', 'profile_sidebar_border_color': 'FFFFFF', 'profile_sidebar_fill_color': '95E8EC', 'profile_text_color': '3C3940', 'profile_use_background_image': False, 'has_extended_profile': False, 'default_profile': False, 'default_profile_image': False, 'following': False, 'follow_request_sent': False, 'notifications': False, 'translator_type': 'none'};;;;;;False;0;1;False;False;en;;;;;;;;;1
