-------------------------------------------------------------------------------
Test set: TestScenarios
-------------------------------------------------------------------------------
Tests run: 8, Failures: 2, Errors: 0, Skipped: 0, Time elapsed: 7.005 s <<< FAILURE! - in TestScenarios
validateDelete(TestScenarios)  Time elapsed: 0.515 s  <<< FAILURE!
java.lang.AssertionError: 
1 expectation failed.
Expected status code <204> but was <200>.

	at TestScenarios.validateDelete(TestScenarios.java:49)

validateInvalidPayload(TestScenarios)  Time elapsed: 0.491 s  <<< FAILURE!
java.lang.AssertionError: 
1 expectation failed.
Expected status code <400> but was <201>.

	at TestScenarios.validateInvalidPayload(TestScenarios.java:107)

