{
  "shell_port": 52357,
  "iopub_port": 40531,
  "stdin_port": 52487,
  "control_port": 60441,
  "hb_port": 46127,
  "ip": "127.0.0.1",
  "key": "768f902b-d86a60c02069a8c71cd88a6d",
  "transport": "tcp",
  "signature_scheme": "hmac-sha256",
  "kernel_name": ""
}