{
  "shell_port": 49529,
  "iopub_port": 59477,
  "stdin_port": 41141,
  "control_port": 55753,
  "hb_port": 52667,
  "ip": "127.0.0.1",
  "key": "722358e7-b0b724d84f3948b5c3bbe3f0",
  "transport": "tcp",
  "signature_scheme": "hmac-sha256",
  "kernel_name": ""
}