{
  "shell_port": 33501,
  "iopub_port": 54041,
  "stdin_port": 56991,
  "control_port": 42173,
  "hb_port": 42907,
  "ip": "127.0.0.1",
  "key": "7df4bc5f-96ef15b2bccb37c006d295c9",
  "transport": "tcp",
  "signature_scheme": "hmac-sha256",
  "kernel_name": ""
}