{
  "base_url": "/user/anais.rouxel-tp-mt15-2021-p4du2xnw/",
  "hostname": "0.0.0.0",
  "notebook_dir": "/home/jovyan",
  "password": false,
  "pid": 18,
  "port": 8888,
  "secure": false,
  "sock": "",
  "token": "ztNNkU0uQu2aO8XqsM8iUA",
  "url": "http://0.0.0.0:8888/user/anais.rouxel-tp-mt15-2021-p4du2xnw/"
}