{
  "shell_port": 54907,
  "iopub_port": 33385,
  "stdin_port": 53157,
  "control_port": 52757,
  "hb_port": 55707,
  "ip": "127.0.0.1",
  "key": "9c092d02-e6eeeb07d5d103269866486e",
  "transport": "tcp",
  "signature_scheme": "hmac-sha256",
  "kernel_name": ""
}