{
  "shell_port": 49675,
  "iopub_port": 35865,
  "stdin_port": 49069,
  "control_port": 57335,
  "hb_port": 57675,
  "ip": "127.0.0.1",
  "key": "440c462d-96e6c13cbfd647e46752f9aa",
  "transport": "tcp",
  "signature_scheme": "hmac-sha256",
  "kernel_name": ""
}