{
  "shell_port": 39593,
  "iopub_port": 54397,
  "stdin_port": 58279,
  "control_port": 58549,
  "hb_port": 35971,
  "ip": "127.0.0.1",
  "key": "543bba78-1e4b069b243a51ce42ff1e2d",
  "transport": "tcp",
  "signature_scheme": "hmac-sha256",
  "kernel_name": ""
}