{
  "image": "docker.io/anagolay/workspaces-operation:latest",
  "name": "Anagolay File Operation",
  "settings": {
    "lldb.executable": "/usr/bin/lldb",
    // VS Code don't watch files under ./target
    "files.watcherExclude": {
      "**/target/**": true
    },
    "rust-analyzer.checkOnSave.command": "clippy"
  },
  "extensions": [
    "rust-lang.rust",
    "vadimcn.vscode-lldb",
    "bungcip.better-toml",
    "mhutchie.git-graph"
  ],
  "remoteUser": "vscode"
}