<?xml version="1.0" encoding="UTF-8"?>
<robot generator="Robot 3.2.2 (Python 3.8.10 on linux)" generated="20230227 15:55:18.445" rpa="false">
<suite id="s1" name="Testsuites" source="/home/anagha.k@ah.zymrinc.com/eclipse-workspace/Newtour_project/testsuites">
<suite id="s1-s1" name="NewtourTestcase" source="/home/anagha.k@ah.zymrinc.com/eclipse-workspace/Newtour_project/testsuites/NewtourTestcase.robot">
<test id="s1-s1-t1" name="LoginTest">
<kw name="Open my Browser" library="newtourKeywords">
<kw name="Open Browser" library="SeleniumLibrary">
<doc>Opens a new browser instance to the optional ``url``.</doc>
<arguments>
<arg>${SiteURL}</arg>
<arg>${Browser}</arg>
</arguments>
<msg timestamp="20230227 15:55:18.729" level="INFO">Opening browser 'chrome' to base url 'https://demo.guru99.com/test/newtours/'.</msg>
<status status="PASS" starttime="20230227 15:55:18.729" endtime="20230227 15:55:25.889"></status>
</kw>
<kw name="Maximize Browser Window" library="SeleniumLibrary">
<doc>Maximizes current browser window.</doc>
<status status="PASS" starttime="20230227 15:55:25.890" endtime="20230227 15:55:26.021"></status>
</kw>
<status status="PASS" starttime="20230227 15:55:18.728" endtime="20230227 15:55:26.022"></status>
</kw>
<kw name="Enter Username" library="newtourKeywords">
<kw name="Input Text" library="SeleniumLibrary">
<doc>Types the given ``text`` into the text field identified by ``locator``.</doc>
<arguments>
<arg>${username}</arg>
<arg>${txt_user}</arg>
</arguments>
<msg timestamp="20230227 15:55:26.026" level="INFO">Typing text 'mercury' into text field '//input[@name='userName']'.</msg>
<status status="PASS" starttime="20230227 15:55:26.025" endtime="20230227 15:55:26.508"></status>
</kw>
<status status="PASS" starttime="20230227 15:55:26.023" endtime="20230227 15:55:26.508"></status>
</kw>
<kw name="Enter Password" library="newtourKeywords">
<kw name="Input Text" library="SeleniumLibrary">
<doc>Types the given ``text`` into the text field identified by ``locator``.</doc>
<arguments>
<arg>${password}</arg>
<arg>${txt_password}</arg>
</arguments>
<msg timestamp="20230227 15:55:26.511" level="INFO">Typing text 'mercury' into text field '//input[@name='password']'.</msg>
<status status="PASS" starttime="20230227 15:55:26.510" endtime="20230227 15:55:26.676"></status>
</kw>
<status status="PASS" starttime="20230227 15:55:26.509" endtime="20230227 15:55:26.676"></status>
</kw>
<kw name="Click Signin" library="newtourKeywords">
<kw name="Click Button" library="SeleniumLibrary">
<doc>Clicks the button identified by ``locator``.</doc>
<arguments>
<arg>${loginbtn}</arg>
</arguments>
<msg timestamp="20230227 15:55:26.678" level="INFO">Clicking button '//input[@name='submit']'.</msg>
<status status="PASS" starttime="20230227 15:55:26.677" endtime="20230227 15:55:28.683"></status>
</kw>
<status status="PASS" starttime="20230227 15:55:26.677" endtime="20230227 15:55:28.684"></status>
</kw>
<kw name="Sleep" library="BuiltIn">
<doc>Pauses the test executed for the given time.</doc>
<arguments>
<arg>3 seconds</arg>
</arguments>
<msg timestamp="20230227 15:55:31.685" level="INFO">Slept 3 seconds</msg>
<status status="PASS" starttime="20230227 15:55:28.684" endtime="20230227 15:55:31.686"></status>
</kw>
<kw name="Verify Successful Login" library="newtourKeywords">
<kw name="Title Should Be" library="SeleniumLibrary">
<doc>Verifies that the current page title equals ``title``.</doc>
<arguments>
<arg>Login: Mercury Tours</arg>
</arguments>
<msg timestamp="20230227 15:55:31.705" level="INFO">Page title is 'Login: Mercury Tours'.</msg>
<status status="PASS" starttime="20230227 15:55:31.688" endtime="20230227 15:55:31.706"></status>
</kw>
<status status="PASS" starttime="20230227 15:55:31.687" endtime="20230227 15:55:31.706"></status>
</kw>
<kw name="Close my Browser" library="newtourKeywords">
<kw name="Close All Browsers" library="SeleniumLibrary">
<doc>Closes all open browsers and resets the browser cache.</doc>
<status status="PASS" starttime="20230227 15:55:31.708" endtime="20230227 15:55:31.764"></status>
</kw>
<status status="PASS" starttime="20230227 15:55:31.707" endtime="20230227 15:55:31.765"></status>
</kw>
<doc>This Test case is for login</doc>
<status status="PASS" starttime="20230227 15:55:18.728" endtime="20230227 15:55:31.766" critical="yes"></status>
</test>
<test id="s1-s1-t2" name="RegistrationTest">
<kw name="Open my Browser" library="newtourKeywords">
<kw name="Open Browser" library="SeleniumLibrary">
<doc>Opens a new browser instance to the optional ``url``.</doc>
<arguments>
<arg>${SiteURL}</arg>
<arg>${Browser}</arg>
</arguments>
<status status="FAIL" starttime="20230227 15:55:31.771" endtime="20230227 15:55:31.772"></status>
</kw>
<status status="FAIL" starttime="20230227 15:55:31.770" endtime="20230227 15:55:31.773"></status>
</kw>
<doc>This Testcase is for Registration</doc>
<status status="FAIL" starttime="20230227 15:55:31.768" endtime="20230227 15:55:31.774" critical="yes">Execution terminated by signal</status>
</test>
<status status="FAIL" starttime="20230227 15:55:18.466" endtime="20230227 15:55:31.779"></status>
</suite>
<status status="FAIL" starttime="20230227 15:55:18.446" endtime="20230227 15:55:31.789"></status>
</suite>
<statistics>
<total>
<stat pass="1" fail="1">Critical Tests</stat>
<stat pass="1" fail="1">All Tests</stat>
</total>
<tag>
</tag>
<suite>
<stat pass="1" fail="1" id="s1" name="Testsuites">Testsuites</stat>
<stat pass="1" fail="1" id="s1-s1" name="NewtourTestcase">Testsuites.NewtourTestcase</stat>
</suite>
</statistics>
<errors>
</errors>
</robot>
