{
  "name": "testECDSA",
  "isPublic": false,
  "viewMode": false,
  "appIsExample": false,
  "unreadCommentThreads": 0,
  "color": "#ECECEC",
  "icon": "single-person",
  "slug": "testecdsa",
  "evaluationVersion": 2,
  "publishedModeThemeId": "61d2c241de5610038e355e2f",
  "editModeThemeId": "61d2c241de5610038e355e2f",
  "createdAt": {
    "seconds": 1641892360,
    "nanos": 257000000
  },
  "deleted": false
}