{
    "boxShadow": "none",
    "isCompact": false,
    "widgetName": "Menu_button",
    "displayName": "Menu Button",
    "iconSVG": "/static/media/icon.0341d17d67020c8bfc560cc5928af2a7.svg",
    "bottomRow": 11,
    "topRow": 6,
    "parentRowSpace": 10,
    "type": "MENU_BUTTON_WIDGET",
    "hideCard": false,
    "animateLoading": true,
    "dynamicTriggerPathList": [
        {"key": "menuItems.menuItem1.onClick"},
        {"key": "menuItems.menuItem2.onClick"},
        {"key": "menuItems.menuItem93y1l3qly0.onClick"}
    ],
    "parentColumnSpace": 13.9814453125,
    "dynamicBindingPathList": [{"key": "borderRadius"}],
    "leftColumn": 60,
    "isDisabled": false,
    "key": "8de2s6u1o4",
    "isDeprecated": false,
    "rightColumn": 62,
    "iconName": "menu",
    "menuVariant": "PRIMARY",
    "widgetId": "ltc5m27yfx",
    "menuItems": {
        "menuItem1": {
            "onClick": "{{navigateTo('Dashboard', {})}}",
            "widgetId": "",
            "index": 0,
            "label": "Dashboard",
            "id": "menuItem1",
            "isVisible": true,
            "isDisabled": false
        },
        "menuItem93y1l3qly0": {
            "onClick": "{{navigateTo('App usage', {})}}",
            "widgetId": "47913puvxu",
            "index": 2,
            "id": "menuItem93y1l3qly0",
            "label": "App usage",
            "isDisabled": false,
            "isVisible": true
        },
        "menuItem2": {
            "onClick": "{{navigateTo('Search', {})}}",
            "widgetId": "",
            "index": 1,
            "label": "Search",
            "id": "menuItem2",
            "isVisible": true,
            "isDisabled": false
        }
    },
    "isVisible": true,
    "label": "",
    "version": 1,
    "parentId": "95kyihif82",
    "isLoading": false,
    "renderMode": "CANVAS",
    "borderRadius": "{{appsmith.theme.borderRadius.appBorderRadius}}",
    "menuColor": "#000D3D",
    "iconAlign": "left",
    "placement": "CENTER"
}