{
    "boxShadow": "none",
    "widgetName": "Canvas1Copy2",
    "displayName": "Canvas",
    "bottomRow": 130,
    "topRow": 0,
    "parentRowSpace": 1,
    "canExtend": false,
    "type": "CANVAS_WIDGET",
    "hideCard": true,
    "minHeight": 140,
    "parentColumnSpace": 1,
    "dynamicBindingPathList": [
        {"key": "borderRadius"},
        {"key": "accentColor"}
    ],
    "leftColumn": 0,
    "children": [
        "Image2Copy",
        "Divider1Copy",
        "Text1Copy2",
        "Text2Copy2"
    ],
    "key": "pkalc7zdin",
    "isDeprecated": false,
    "rightColumn": 225,
    "detachFromLayout": true,
    "accentColor": "{{appsmith.theme.colors.primaryColor}}",
    "widgetId": "v4wvxayhto",
    "containerStyle": "none",
    "isVisible": true,
    "version": 1,
    "parentId": "hwh0qb7lp4",
    "isLoading": false,
    "renderMode": "CANVAS",
    "borderRadius": "{{appsmith.theme.borderRadius.appBorderRadius}}"
}