{
    "boxShadow": "{{appsmith.theme.boxShadow.appBoxShadow}}",
    "widgetName": "Orders_Refunded",
    "isCanvas": true,
    "displayName": "Stats Box",
    "iconSVG": "/static/media/icon.382a7c7bc55323fbbd8edd79208c5324.svg",
    "bottomRow": 32,
    "topRow": 18,
    "parentRowSpace": 10,
    "type": "STATBOX_WIDGET",
    "hideCard": false,
    "animateLoading": true,
    "dynamicTriggerPathList": [],
    "parentColumnSpace": 14.0625,
    "dynamicBindingPathList": [{"key": "boxShadow"}],
    "leftColumn": 48,
    "children": ["Canvas1Copy1"],
    "key": "5m7may5ry7",
    "backgroundColor": "#192550",
    "isDeprecated": false,
    "rightColumn": 62,
    "widgetId": "puoeb3szfz",
    "isVisible": true,
    "parentId": "95kyihif82",
    "isLoading": false,
    "renderMode": "CANVAS",
    "borderRadius": "0.375rem"
}