{
    "widgetName": "chart_value",
    "displayName": "Text",
    "iconSVG": "/static/media/icon.97c59b523e6f70ba6f40a10fc2c7c5b5.svg",
    "bottomRow": 13,
    "searchTags": [
        "typography",
        "paragraph",
        "label"
    ],
    "topRow": 9,
    "parentRowSpace": 10,
    "type": "TEXT_WIDGET",
    "hideCard": false,
    "animateLoading": true,
    "dynamicTriggerPathList": [],
    "fontFamily": "{{appsmith.theme.fontFamily.appFont}}",
    "overflow": "NONE",
    "parentColumnSpace": 5.0126953125,
    "dynamicBindingPathList": [
        {"key": "fontFamily"},
        {"key": "borderRadius"},
        {"key": "text"}
    ],
    "leftColumn": 0,
    "shouldTruncate": false,
    "truncateButtonColor": "#FFC13D",
    "text": "{{Utils.delayedOrders()}}%",
    "key": "0lx8vhai2t",
    "isDeprecated": false,
    "rightColumn": 64,
    "textAlign": "CENTER",
    "widgetId": "607686ko84",
    "isVisible": true,
    "fontStyle": "BOLD",
    "textColor": "#f2726f",
    "version": 1,
    "parentId": "r4x22kj1tx",
    "isLoading": false,
    "renderMode": "CANVAS",
    "borderRadius": "{{appsmith.theme.borderRadius.appBorderRadius}}",
    "fontSize": "1rem"
}