{
    "boxShadow": "{{appsmith.theme.boxShadow.appBoxShadow}}",
    "borderColor": "transparent",
    "widgetName": "Delivery_error_rate",
    "isCanvas": true,
    "displayName": "Container",
    "iconSVG": "/static/media/icon.1977dca3370505e2db3a8e44cfd54907.svg",
    "bottomRow": 182,
    "searchTags": [
        "div",
        "parent",
        "group"
    ],
    "topRow": 150,
    "parentRowSpace": 10,
    "type": "CONTAINER_WIDGET",
    "hideCard": false,
    "animateLoading": true,
    "parentColumnSpace": 17.9375,
    "dynamicBindingPathList": [
        {"key": "borderRadius"},
        {"key": "boxShadow"}
    ],
    "leftColumn": 34,
    "children": ["Canvas112"],
    "borderWidth": "0",
    "key": "ltkcmcjzaq",
    "backgroundColor": "#FFFFFF",
    "isDeprecated": false,
    "rightColumn": 62,
    "widgetId": "p8yvhdufas",
    "containerStyle": "card",
    "isVisible": true,
    "version": 1,
    "parentId": "0",
    "isLoading": false,
    "renderMode": "CANVAS",
    "borderRadius": "{{appsmith.theme.borderRadius.appBorderRadius}}"
}