{
    "widgetName": "Text1Copy1Copy",
    "displayName": "Text",
    "iconSVG": "/static/media/icon.97c59b523e6f70ba6f40a10fc2c7c5b5.svg",
    "bottomRow": 6,
    "searchTags": [
        "typography",
        "paragraph",
        "label"
    ],
    "topRow": 1,
    "type": "TEXT_WIDGET",
    "hideCard": false,
    "animateLoading": true,
    "dynamicTriggerPathList": [],
    "fontFamily": "Inter",
    "overflow": "NONE",
    "dynamicBindingPathList": [{"key": "borderRadius"}],
    "leftColumn": 9,
    "shouldTruncate": false,
    "truncateButtonColor": "#FFC13D",
    "text": "Orders delayed",
    "key": "j0z4cpigeh",
    "isDeprecated": false,
    "rightColumn": 41,
    "textAlign": "LEFT",
    "widgetId": "hbh4galrxa",
    "isVisible": true,
    "fontStyle": "",
    "textColor": "#fff",
    "version": 1,
    "parentId": "dw3oeshlc6",
    "isLoading": false,
    "renderMode": "CANVAS",
    "borderRadius": "{{appsmith.theme.borderRadius.appBorderRadius}}",
    "fontSize": "1rem"
}