{
    "boxShadow": "none",
    "borderColor": "#E0DEDE",
    "widgetName": "Container1",
    "isCanvas": true,
    "displayName": "Container",
    "iconSVG": "/static/media/icon.1977dca3370505e2db3a8e44cfd54907.svg",
    "bottomRow": 21,
    "searchTags": [
        "div",
        "parent",
        "group"
    ],
    "topRow": 0,
    "parentRowSpace": 10,
    "type": "CONTAINER_WIDGET",
    "hideCard": false,
    "shouldScrollContents": false,
    "animateLoading": true,
    "dynamicTriggerPathList": [],
    "parentColumnSpace": 17.8125,
    "dynamicBindingPathList": [{"key": "borderRadius"}],
    "leftColumn": 0,
    "children": ["Canvas113"],
    "borderWidth": "1",
    "key": "1ogjwx3uen",
    "backgroundColor": "#000D3D",
    "isDeprecated": false,
    "rightColumn": 64,
    "dynamicHeight": "FIXED",
    "widgetId": "tw7iwtp79f",
    "containerStyle": "card",
    "isVisible": true,
    "version": 1,
    "parentId": "0",
    "isLoading": false,
    "renderMode": "CANVAS",
    "borderRadius": "{{appsmith.theme.borderRadius.appBorderRadius}}",
    "maxDynamicHeight": 9000,
    "minDynamicHeight": 4
}