{
    "progressType": "linear",
    "widgetName": "error_rate",
    "isCanvas": false,
    "displayName": "Progress",
    "iconSVG": "/static/media/icon.9b0d7b96a0223e8120bf6f14aca4154a.svg",
    "bottomRow": 25,
    "searchTags": ["percent"],
    "topRow": 13,
    "parentRowSpace": 10,
    "type": "PROGRESS_WIDGET",
    "isIndeterminate": false,
    "hideCard": false,
    "fillColor": "#F2726F",
    "dynamicTriggerPathList": [],
    "parentColumnSpace": 17.9375,
    "dynamicBindingPathList": [
        {"key": "borderRadius"},
        {"key": "progress"}
    ],
    "leftColumn": 0,
    "key": "h1sbqdir2x",
    "showResult": false,
    "isDeprecated": false,
    "rightColumn": 64,
    "counterClosewise": false,
    "widgetId": "k8zxpgb88m",
    "isVisible": true,
    "steps": "5",
    "version": 1,
    "parentId": "r4x22kj1tx",
    "isLoading": false,
    "renderMode": "CANVAS",
    "borderRadius": "{{appsmith.theme.borderRadius.appBorderRadius}}",
    "progress": "{{Utils.delayedOrders()}}"
}