java/hexagonal/springboot/jpa/infraestructure/adapters/controllers/PriceController.class
java/hexagonal/springboot/jpa/application/services/PriceService.class
java/hexagonal/springboot/jpa/domain/models/Price.class
java/hexagonal/springboot/jpa/domain/repositories/PriceRepository.class
